min count: 1
path:
  inverse path: hat Ende der Existenz

min count: 1
path:
  inverse path: hat Beginn der Existenz

min count: 1
path:
  inverse path: hat Änderung der Existenz

DIKUSA Core Ontology
type: Ontology
description: The DIKUSA core ontology is used for the linking of digital cultural data of research projects in Saxony, Germany. It is applied by six Saxon non-university DH research institutions within the DIKUSA-project (Vernetzung digitaler Kulturdaten in Sachsen). It is used as a common core ontology to harmonize the data of the partners which internally use their own specialized ontology for creating research-related knowledge bases. Central categories of the ontology are person, place, group, object, bibliographic item and event. The ontology is provided as an RDF(star)-file in turtle-format. Shacl-constraints for validation of knowledge bases against the schema are included.
license: https://www.gnu.org/licenses/agpl-3.0.en.html

Akteur
type: Class
comment: Superclass of person and group, entities that can act on their own behalf.
label: actor @en
subclass of: Entität mit Objekt-Relation

Akteur-Objekt-Relation
type: Class
comment: An entity representing a relation where an actor (person or group) and an object play a central role, can be related to a timespan.
label: actor object relation @en
subclass of: Akteur-Relation
subclass of: Entität mit Beschreibung
subclass of: Entität mit Name
subclass of: Entität mit Zeitspanne
subclass of: Objekt-Relation

Akteur-Objekt-Relation-Typ
type: Class
comment: The type of a relation between an object and an actor (property of, holder of, ...).
label: actor object relation type @en
subclass of: Entität mit Beschreibung
subclass of: Entität mit Name

Akteur-Relation
type: Class
comment: Internal superclass, relations where one participant is an actor (person or group).
label: actor relation @en

Adresse
type: Class
comment: The address of a place, can be limited to a specific time period.
label: address @en
subclass of: Entität mit Beschreibung
subclass of: Entität mit Zeitspanne
property:
  min count: 1
  path:
    inverse path: hat Adresse

Autor
type: Class
comment: The author of an entity.
label: author @en

Autorenrolle
type: Class
comment: The role of an author in the authoring process.
label: author role @en
subclass of: Entität mit Beschreibung
subclass of: Entität mit Name

Beginn der Existenz
type: Class
comment: The event that is marked as the beginning of the existence of an entity, aimes primarily at geographical entities like cities or countries or at groups, can have a type
label: begin of existence @en
subclass of: Änderung der Existenz
property:
  min count: 1
  path:
    inverse path: hat Beginn der Existenz

Änderung der Existenz
type: Class
comment: Superclass for the events marked as the beginning end or change of the existence of an entity, subclass of event
label: change of existence @en
subclass of: Ereignis

Typ der Änderung der Existenz einer Gruppe
type: Class
comment: The type of an event that is marked as the beginning, end or as a change of the existence of an entity of type group, like founding, dissolution.
label: change of group existence type @en
subclass of: Entität mit Beschreibung
subclass of: Entität mit Name

Typ der Änderung der Existenz eines Ortes
type: Class
comment: The type of an event that is marked as the beginning, end or as a change of the existence of an entity of type place.
label: change of place existence type @en
subclass of: Entität mit Beschreibung
subclass of: Entität mit Name

Zitation
type: Class
comment: A citation where an entity is mentioned, is related to this entity and to a resource of class work.
label: citation @en
subclass of: Entität mit Beschreibung

Koordinaten
type: Class
comment: The geographical coordinates of a place, can be further described e.g. with a period of time.
label: coordinates @en
subclass of: Entität mit Beschreibung
subclass of: Entität mit Zeitspanne
property:
  min count: 1
  path:
    inverse path: hat Koordinaten
property:
  max count: 1
  min count: 1
  path: hat Koordinaten-Wert

Dimension
type: Class
comment: An dimension of an object, containing e.g. informations about its height.
label: dimension @en
subclass of: Entität mit Beschreibung
subclass of: Entität mit Name

Dimensions-Typ
type: Class
comment: The type of a dimension of an object (could be height, width, diameter, ...).
label: dimension type @en
subclass of: Entität mit Beschreibung
subclass of: Entität mit Name

Dimensions-Einheit
type: Class
comment: The unit of a dimension of an object (could be cm, mm, ...).
label: dimension unit @en
subclass of: Entität mit Beschreibung
subclass of: Entität mit Name

Ende der Existenz
type: Class
comment: The event that is marked as the end of the existence of an entity, aimes primarily at geographical entities like cities or countries or at groups, can have a type
label: end of existence @en
subclass of: Änderung der Existenz
property:
  min count: 1
  path:
    inverse path: hat Ende der Existenz

Entitätenbeschreibung
type: Class
comment: Contains the general description of an entity
label: entity description @en
subclass of: Entität mit Autor

Entität mit Akteur-Relation
type: Class
comment: Internal superclass, entities that can participate in direct relations with actors (persons or groups).
label: entity with actor relation @en

Entität mit Autor
type: Class
comment: All entities that can have an author.
label: entity with author @en

Entität mit Zitation
type: Class
comment: All entities that can be cited.
label: entity with citation @en

Entität mit (akad.) Titel
type: Class
comment: All entities that can have a degree or are related to one.
label: entity with degree @en

Entität mit Beschreibung
type: Class
comment: All entities that can have an description.
label: entity with description @en

Entität mit Event-Relation
type: Class
comment: Internal superclass, entities that can participate in direct relations with events.
label: entity with event relation @en

Entität mit Existenzveränderung
type: Class
comment: Entities such as places or groups, that might be established, dissolved or experience changes to their state of existence.
label: entity with existence change @en

Entität mit externer Referenz
type: Class
comment: All entities that can be linked to an external reference (URI).
label: entity with external reference @en

Entität mit Gruppe
type: Class
comment: All entities that can be directly linked to a group.
label: entity with group @en

Entität mit Gruppenrelation
type: Class
comment: Internal superclass, all entities that can participate in direct relations with groups.
label: entity with group relation @en

Entität mit ID
type: Class
comment: All entities that can be linked to an ID such as GND.
label: entity with id @en

Entität mit Ort
type: Class
comment: Internal superclass, entities that have direct relations with locations.
label: entity with location @en

Entität mit Name
type: Class
comment: All entities that can have a name.
label: entity with name @en

Entität mit Objekt
type: Class
comment: Internal superclass, entities that have direct relations with objects.
label: entity with object @en

Entität mit Objekt-Relation
type: Class
comment: Internal superclass, entities that can participate in direct relations with objects.
label: entity with object relation @en

Entität mit Beruf
type: Class
comment: Internal superclass, all entities that can have an occupation.
label: entity with occupation value @en

Entität mit Personenrelation
type: Class
comment: Internal superclass, all entities that can participate in direct relations with persons.
label: entity with person relation @en

Entität mit Ort
type: Class
comment: All entities that can be directly linked to a place.
label: entity with place @en

Entität mit Ortsrelation
type: Class
comment: Internal superclass, all entities that can participate in direct relations with places.
label: entity with place relation @en

Entität mit Ressourcen-Relation
type: Class
comment: Internal superclass, entities that can participate in direct relations with resources.
label: entity with resource relation @en

Entität mit Schreibsystem
type: Class
comment: All entities that can have a writing script.
label: entity with script @en

Entität mit Zeitspanne
type: Class
comment: Entity which is directly related to a period of time.
label: timeframe related entity @en

Entität mit Zeitpunkt
type: Class
comment: Entity which is directly related to a point in time.
label: timepoint related entity @en

Entität mit Titel
type: Class
comment: All entities that can have a title.
label: entity with title @en

Ereignis
type: Class
comment: Any kind of event taking place, such as gatherings of people for various reasons.
label: event @en
subclass of: Entität mit Zitation
subclass of: Entität mit Beschreibung
subclass of: Entität mit Event-Relation
subclass of: Entität mit externer Referenz
subclass of: Entität mit ID
subclass of: Entität mit Ort
subclass of: Entität mit Name
subclass of: Entität mit Ressourcen-Relation
subclass of: Entität mit Zeitspanne

Event-Event-Relation
type: Class
comment: An entity representing a general relation where two events play a central role, can be related to a timespan, a name, a description and a type.
label: event event relation @en
subclass of: Entität mit Beschreibung
subclass of: Entität mit Name
subclass of: Entität mit Zeitspanne
subclass of: Event-Relation

Event-Event-Relationen-Typ
type: Class
comment: The type of a relation between two events.
label: event event relation type @en
subclass of: Entität mit Beschreibung
subclass of: Entität mit Name

Event-Relation
type: Class
comment: Internal superclass, relations where one participant is an event.
label: event relation @en

Event-Ressourcen-Relation
type: Class
comment: An entity representing a relation where an event and a resource play a central role, can be related to a timespan.
label: event resource relation @en
subclass of: Entität mit Beschreibung
subclass of: Entität mit Name
subclass of: Entität mit Zeitspanne
subclass of: Event-Relation
subclass of: Ressourcen-Relation

Event-Ressourcen-Relationen-Typ
type: Class
comment: The type of a relation between an event and a resource.
label: event resource relation type @en
subclass of: Entität mit Beschreibung
subclass of: Entität mit Name

Eventtyp
type: Class
comment: The type of an event.
label: event type @en
subclass of: Entität mit Beschreibung
subclass of: Entität mit Name

Geschlecht
type: Class
comment: The gender of an entity; can include a timeframe of validity if necessary.
label: gender @en
subclass of: Entität mit Beschreibung
subclass of: Entität mit Zeitspanne

gender value
type: Class
comment: The actual gender, preferably from LIDO gender actor vocabulary (see folder vocabularies on github).
label: Geschlechter-Wert
label: has gender value @en
subclass of: ID

Gruppe
type: Class
comment: Different kinds of groups of people or general institutions, such as companies, clubs or schools.
label: group @en
subclass of: Akteur
subclass of: Entität mit Zitation
subclass of: Entität mit Beschreibung
subclass of: Entität mit Existenzveränderung
subclass of: Entität mit externer Referenz
subclass of: Entität mit ID
subclass of: Entität mit Ort
subclass of: Entität mit Name
subclass of: Entität mit Personenrelation

Gruppenrelation
type: Class
comment: Internal superclass, all relations where one participant is a group.
label: group relation @en

Typ der Gruppe
type: Class
comment: The type of a group.
label: group type @en
subclass of: Entität mit Beschreibung
subclass of: Entität mit Name

hat Akteur-Objekt-Relation-Typ
type: ObjectProperty
comment: Relation between a relation of an actor and an object and its type.
domain: Akteur-Objekt-Relation
label: has actor object relation type @en
range: Akteur-Objekt-Relation-Typ

hat Akteur-Objekt-Relation-Typ - invers
type: ObjectProperty
comment: Inverse relation to has_actor_object_relation_type.
label: has actor object relation type - inverse @en
inverse of: hat Akteur-Objekt-Relation-Typ

hat Akteur-Relation
type: ObjectProperty
comment: Links an entity to a relation-entity which is itself connected to an actor (person or group).
domain: Entität mit Akteur-Relation
label: has actor relation @en
range: Akteur-Relation

hat Akteur-Relation - invers
type: ObjectProperty
comment: Inverse relation to has_actor_relation.
label: has actor relation - inverse @en
inverse of: hat Akteur-Relation

hat Adresse
type: ObjectProperty
comment: Relation between a place and its adress.
domain: Ort
label: has address @en
range: Adresse

hat Adresse - invers
type: ObjectProperty
comment: Inverse relation to has_address.
label: has address - inverse @en
inverse of: hat Adresse

hat alternativen Namen
type: ObjectProperty
comment: Relationship between an entity and its alternative name, subproperty of has_name.
label: has alternative name @en
sub property of: hat Name

hat alternativen Namen - invers
type: ObjectProperty
comment: Inverse relation to has_alternative_name.
label: has alternative name - inverse @en
inverse of: hat alternativen Namen

hat alternativen Titel
type: ObjectProperty
comment: A relation between an entity and its alternative title, subproperty of title.
label: has alternative title @en
sub property of: hat Titel

hat alternativen Titel - invers
type: ObjectProperty
comment: Inverse relation to has_alternative_title.
label: has alternative title - inverse @en
inverse of: hat alternativen Titel

hat Autor
type: ObjectProperty
comment: Relation linking an entity to its author.
domain: Entität mit Autor
label: has author @en
range: Autor

hat Autor - invers
type: ObjectProperty
comment: Inverse relation to has_author.
label: has author - inverse @en
inverse of: hat Autor

hat Autorenrolle
type: ObjectProperty
comment: Relation between an author and its role in the authoring process.
domain: Autor
label: has author role @en
range: Autorenrolle

hat Autorenrolle - invers
type: ObjectProperty
comment: Inverse relation to has_author_role.
label: has author role - inverse @en
inverse of: hat Autorenrolle

hat Autorenwert
type: ObjectProperty
comment: Relation linking an author entity to the actual person or group that did the authoring.
domain: Autor
label: has author value @en
range: Akteur

hat Autorenwert - invers
type: ObjectProperty
comment: Inverse relation to has_author_value.
label: has author value - inverse @en
inverse of: hat Autorenwert

hat frühesten Beginn
type: AnnotationProperty
comment: Relation linking an entity to the beginning of a period of time, specifically the earliest possible beginning.
domain: Entität mit Zeitspanne
label: has begin earliest @en
range: Literal
sub property of: hat Wert

hat spätesten Beginn
type: AnnotationProperty
comment: Relation linking an entity to the beginning of a period of time, specifically the latest possible beginning.
domain: Entität mit Zeitspanne
label: has begin latest @en
range: Literal
sub property of: hat Wert

hat Beginn der Existenz
type: ObjectProperty
comment: Relation between entities (mainly geographical ones like cities, countries or group entities) and the event that is marked as the beginning of their existence.
domain: Entität mit Existenzveränderung
label: has begin of existence @en
range: Änderung der Existenz

hat Beginn der Existenz - invers
type: ObjectProperty
comment: Inverse relation to has_begin_of_existence.
label: has begin of existence - inverse @en
inverse of: hat Beginn der Existenz

hat Geburtsereignis
type: ObjectProperty
comment: Relation linking an entity to its birth event.
label: has birth @en
sub property of: hat Lebensstatusänderung

hat Geburt - invers
type: ObjectProperty
comment: Inverse relation to has_birth.
label: has birth - inverse @en
inverse of: hat Geburtsereignis

hat Änderung der Existenz
type: ObjectProperty
comment: Relation between entities (mainly geographical ones like cities, countries or group entities) and the event that is marked as a change to their existence, like the incorporation of a place into another one.
domain: Entität mit Existenzveränderung
label: has change of existence @en
range: Änderung der Existenz

hat Änderung der Existenz - invers
type: ObjectProperty
comment: Inverse relation to has_change_of_existence.
label: has change of existence - inverse @en
inverse of: hat Änderung der Existenz

hat Typ der Änderung der Existenz einer Gruppe
type: ObjectProperty
comment: Relation to the type of an event that is marked as the beginning, end or as a change of the existence of an entity of type group, like founding, dissolution.
domain: Änderung der Existenz
label: has change of group existence type @en
range: Typ der Änderung der Existenz einer Gruppe

hat Typ der Änderung der Existenz einer Gruppe - invers
type: ObjectProperty
comment: Inverse relation to has_change_of_group_existence_type.
label: has change of group existence type - inverse @en
inverse of: hat Typ der Änderung der Existenz einer Gruppe

hat Typ der Änderung der Existenz eines Ortes
type: ObjectProperty
comment: Relation to the type of an event that is marked as the beginning, end or as a change of the existence of an entity of type place.
domain: Änderung der Existenz
label: has change of place existence type @en
range: Typ der Änderung der Existenz eines Ortes

hat Typ der Änderung der Existenz eines Ortes - invers
type: ObjectProperty
comment: Inverse relation to has_change_of_place_existence_type.
label: has change of place existence type - inverse @en
inverse of: hat Typ der Änderung der Existenz eines Ortes

hat Zitation
type: ObjectProperty
comment: A relation between an entity and a citation where the entity is mentioned.
domain: Entität mit Zitation
label: has citation @en
range: Zitation

hat Zitation - invers
type: ObjectProperty
comment: Inverse relation to has_citation.
label: has citation - inverse @en
inverse of: hat Zitation

hat Zitationsressource
type: AnnotationProperty
type: ObjectProperty
comment: A relation between a citation and the resource where this citation is to be found.
domain: Zitation
label: has citation resource @en
range: Werk
sub property of: value

hat Zitationsressource - invers
type: ObjectProperty
comment: Inverse relation to has_citation_resource.
label: has citation resource - inverse @en
inverse of: hat Zitationsressource

hat Zitationstext
type: AnnotationProperty
comment: A relation between a citation and a string which represents the text of interest.
domain: Zitation
label: has citation text @en
range: string
sub property of: hat Wert

hat Stadt
type: ObjectProperty
comment: Relation between an address and the city it is situated in.
domain: Adresse
label: has city @en
range: Ort

hat Stadt - invers
type: ObjectProperty
comment: Inverse relation to has_city.
label: has city - inverse @en
inverse of: hat Stadt

hat Kommentar
type: AnnotationProperty
comment: Property of a triple containing a general comment about the statement.
label: has comment @en
sub property of: comment
sub property of: hat Tripel-Wert

hat Koordinaten
type: ObjectProperty
comment: Relation between a place and its geographical coordinates.
domain: Ort
label: has coordinates @en
range: Koordinaten

hat Koordinaten - invers
type: ObjectProperty
comment: Inverse relation to has_coordinates.
label: has coordinates - inverse @en
inverse of: hat Koordinaten

hat Koordinaten-Wert
type: DatatypeProperty
comment: Relation between geographical coordinates of a place and the actual value.
domain: Koordinaten
label: has coordinates value @en
range: string

hat Land
type: ObjectProperty
comment: Relation between an address and the country it is situated in.
domain: Adresse
label: has country @en
range: Ort

hat Land - invers
type: ObjectProperty
comment: Inverse relation to has_country.
label: has country - inverse @en
inverse of: hat Land

hat frühestes Datum
type: AnnotationProperty
comment: Relation linking an entity to a timepoint, specifically the earliest possible one.
domain: Entität mit Zeitpunkt
label: has date earliest @en
range: Literal
sub property of: hat Wert

hat spätestes Datum
type: AnnotationProperty
comment: Relation linking an entity to a timepoint, specifically the latest possible one.
domain: Entität mit Zeitpunkt
label: has date latest @en
range: Literal
sub property of: hat Wert

hat Todesereignis
type: ObjectProperty
comment: Relation linking an entity to its death event.
label: has death @en
sub property of: hat Lebensstatusänderung

hat Todesereignis - invers
type: ObjectProperty
comment: Inverse relation to has_death.
label: has death - inverse @en
inverse of: hat Todesereignis

hat Abschluss
type: DatatypeProperty
comment: Property containing the degree of an education-related relation.
domain: Entität mit (akad.) Titel
label: has degree @en
range: string

hat Beschreibung
type: AnnotationProperty
comment: Property of a triple containing a description of the statement.
label: has description @en
sub property of: hat Tripel-Wert

hat Dimension
type: ObjectProperty
comment: Relation between an object and one of its dimensions (containing e.g. informations about its height).
domain: Objekt
label: has dimension @en
range: Dimension

hat Dimension - invers
type: ObjectProperty
comment: Inverse relation to has_dimension.
label: has dimension - inverse @en
inverse of: hat Dimension

hat Dimensions-Typ
type: ObjectProperty
comment: Relation of the dimension of an object with the type of this dimension (could be height, width, diameter, ...).
domain: Dimension
label: has dimension type @en
range: Dimensions-Typ

hat Dimensions-Typ - invers
type: ObjectProperty
comment: Inverse relation to has_dimension_type.
label: has dimension type - inverse @en
inverse of: hat Dimensions-Typ

hat Dimensions-Einheit
type: ObjectProperty
comment: Relation of the dimension of an object with the unit of this dimension.
domain: Dimension
label: has dimension unit @en
range: Dimensions-Einheit

hat Dimensions-Einheit - invers
type: ObjectProperty
comment: Inverse relation to has_dimension_unit.
label: has dimension unit - inverse @en
inverse of: hat Dimensions-Einheit

hat Dimensions-Wert
type: DatatypeProperty
comment: Relation of the dimension of an object with the numerical value of this dimension.
domain: Dimension
label: has dimension value @en
range: Literal

hat frühestes Ende
type: AnnotationProperty
comment: Relation linking an entity to the end of a period of time, specifically the earliest possible end.
domain: Entität mit Zeitspanne
label: has end earliest @en
range: Literal
sub property of: hat Wert

hat spätestes Ende
type: AnnotationProperty
comment: Relation linking an entity to the end of a period of time, specifically the latest possible end.
domain: Entität mit Zeitspanne
label: has end latest @en
range: Literal
sub property of: hat Wert

hat Ende der Existenz
type: ObjectProperty
comment: Relation between entities (mainly geographical ones like cities, countries or group entities) and the event that is marked as the end of their existence.
domain: Entität mit Existenzveränderung
label: has end of existence @en
range: Änderung der Existenz

hat Ende der Existenz - invers
type: ObjectProperty
comment: Inverse relation to has_end_of_existence.
label: has end of existence - inverse @en
inverse of: hat Ende der Existenz

hat Entitätenbeschreibung
type: ObjectProperty
comment: Relation of an entity linking it to an object containing its general description.
domain: Entität mit Beschreibung
label: has entity-description @en
range: Entitätenbeschreibung

hat Beschreibung - invers
type: ObjectProperty
comment: Inverse relation to has_entity_description
label: has description - inverse @en
inverse of: hat Entitätenbeschreibung

hat Entitätenbeschreibungs-Wert
type: AnnotationProperty
comment: Property containing the value of an entity_description.
domain: Entitätenbeschreibung
label: has entity description value @en
sub property of: hat Hauptwert

hat Event-Event-Relationen-Typ
type: ObjectProperty
comment: Relation between a relation (of 2 events) and its type.
domain: Event-Event-Relation
label: has event event relation type @en
range: Event-Event-Relationen-Typ

hat Event-Event-Relationen-Typ - invers
type: ObjectProperty
comment: Inverse relation to has_event_event_relation_type.
label: has event event relation type - inverse @en
inverse of: hat Event-Event-Relationen-Typ

hat Event-Relation
type: ObjectProperty
comment: Links an entity to a relation-entity which is itself connected to an event.
domain: Entität mit Event-Relation
label: has event relation @en
range: Event-Relation

hat Event-Relation - invers
type: ObjectProperty
comment: Inverse relation to has_event_relation.
label: has event relation - inverse @en
inverse of: hat Event-Relation

hat Event-Ressourcen-Relationen-Typ
type: ObjectProperty
comment: Relation between a relation of an event and a resource and its type.
domain: Event-Ressourcen-Relation
label: has event resource relation type @en
range: Event-Ressourcen-Relationen-Typ

hat Event-Ressourcen-Relationen-Typ - invers
type: ObjectProperty
comment: Inverse relation to has_event_resource_relation_type.
label: has event resource relation type - inverse @en
inverse of: hat Event-Ressourcen-Relationen-Typ

hat Eventtyp
type: ObjectProperty
comment: Relation between an event and its type.
domain: Ereignis
label: has event type @en
range: Eventtyp

hat Eventtyp - invers
type: ObjectProperty
comment: Inverse relation to has_event_type.
label: has event type - inverse @en
inverse of: hat Eventtyp

hat Fachrichtung
type: DatatypeProperty
comment: Property containing the field of study, used mainly for education-related relations.
domain: Personen-Gruppen-Relation
label: has field of study @en
range: string

hat erste Seite
type: DatatypeProperty
comment: A property containing the first page of interest of a publication.
domain: Veröffentlichung
label: has first page @en
range: integer

hat Geschlecht
type: ObjectProperty
comment: Relation between an entity (person) and its gender.
domain: Person
label: has gender @en
range: Geschlecht

hat Geschlecht - invers
type: ObjectProperty
comment: Inverse relation to has_gender.
label: has gender - inverse @en
inverse of: hat Geschlecht

hat Geschlechter-Wert
type: ObjectProperty
comment: Property relating to the actual gender of type gender_value, preferably from LIDO gender actor vocabulary.
domain: Geschlecht
label: has gender value @en
range: gender value

hat Geschlechter-Wert - invers
type: ObjectProperty
comment: Inverse relation to has_gender_value.
label: has gender value - inverse @en
inverse of: hat Geschlechter-Wert

hat Gruppe
type: ObjectProperty
comment: Relation linking an entity to a group.
domain: Entität mit Gruppe
label: has group @en
range: Gruppe

hat Gruppe - invers
type: ObjectProperty
comment: Inverse relation to has_group.
label: has group - inverse @en
inverse of: hat Gruppe

hat Relation mit Gruppe
type: ObjectProperty
comment: Links an entity to a relation-entity which is itself connected to a group.
domain: Entität mit Gruppenrelation
label: has group relation @en
range: Gruppenrelation

hat Relation mit Gruppe - invers
type: ObjectProperty
comment: Inverse relation to has_group_relation.
label: has group relation - inverse @en
inverse of: hat Relation mit Gruppe

hat Typ der Gruppe
type: ObjectProperty
comment: A relation between a group and its type.
domain: Gruppe
label: has group type @en
range: Typ der Gruppe

hat Typ der Gruppe - invers
type: ObjectProperty
comment: Inverse relation to has_group_type.
label: has group type - inverse @en
inverse of: hat Typ der Gruppe

hat ID
type: ObjectProperty
comment: Relation between an entity and one of its identifiers.
domain: Entität mit ID
label: has id @en
range: ID

hat ID - invers
type: ObjectProperty
comment: Inverse relation to has_id
label: has id - inverse @en
inverse of: hat ID

hat ID-Typ
type: ObjectProperty
comment: Relation to the type of an identifier.
domain: ID
label: has id type @en
range: ID-Typ

hat ID-Typ - invers
type: ObjectProperty
comment: The inverse relation to has_id_type.
label: has id type - inverse @en
inverse of: hat ID-Typ

hat ID-Wert
type: AnnotationProperty
type: DatatypeProperty
comment: The actual alphanumerical value of the identifier, such as the identifier 134597990 taken from GND.
domain: ID
label: has id value @en
range: string
sub property of: hat Hauptwert

hat Inschriften-Text
type: DatatypeProperty
comment: Relation between an inscription-object and the actual text of the inscription.
domain: Inschrift
label: has inscription text @en
range: Literal

hat letzte Seite
type: DatatypeProperty
comment: A property containing the last page of interest of a publication.
domain: Veröffentlichung
label: has last page @en
range: integer

hat Lizenz
type: ObjectProperty
comment: A relation between a publication and its license.
domain: Veröffentlichung
label: has license @en
range: Lizenz

hat Lizenz - invers
type: ObjectProperty
comment: Inverse relation to has_license.
label: has license - inverse @en
inverse of: hat Lizenz

hat Lebensstatusänderung
type: ObjectProperty
comment: Change of life state, superclass to birth and death.
domain: Person
label: has life state change @en
range: Lebensstatusänderung

hat Lebensstatusänderung - invers
type: ObjectProperty
comment: Inverse relation to has_life_state_change.
label: has life state change - inverse @en
inverse of: hat Lebensstatusänderung

hat Standort
type: ObjectProperty
comment: Relation between an entity and its location.
domain: Entität mit Ort
label: has location @en
range: Standort

hat Standort - invers
type: ObjectProperty
comment: Inverse relation to has_location.
label: has location - inverse @en
inverse of: hat Standort

hat Hauptwert
type: AnnotationProperty
comment: Relation between an entity and its central value, if such a feature exists.
label: has main value @en
sub property of: value
sub property of: hat Wert

hat Material
type: ObjectProperty
comment: Relation between an object and its material.
domain: Objekt
label: has material @en
range: Material

hat Material - invers
type: ObjectProperty
comment: Inverse relation to has_material.
label: has material - inverse @en
inverse of: hat Material

hat Name
type: ObjectProperty
comment: Relationship between an entity and its name.
domain: Entität mit Name
label: has name @en
range: Name

hat Name - invers
type: ObjectProperty
comment: Inverse Relation to has_name.
label: has name - inverse @en
inverse of: hat Name

hat Namenswert
type: AnnotationProperty
type: DatatypeProperty
comment: Relation between a name and its value (string).
domain: Name
label: has name value @en
range: langString
sub property of: hat Hauptwert

hat Nationalität
type: ObjectProperty
comment: Relation between an entity and its nationality.
domain: Person
label: has nationality @en
range: Nationalität

hat Nationalität - invers
type: ObjectProperty
comment: Inverse relation to has_nationality.
label: has nationality - inverse @en
inverse of: hat Nationalität

hat Nationalitätenwert
type: ObjectProperty
comment: Property containing the actual nationality value of an entity.
domain: Nationalität
label: has nationality value @en
range: Nationalitätenwert

hat Nationalitätenwert - invers
type: ObjectProperty
comment: Inverse relation to has_nationality_value
label: has nationality value - inverse @en
inverse of: hat Nationalitätenwert

hat Anzahl Seiten
type: DatatypeProperty
comment: A property containing the number of pages of a publication.
domain: Veröffentlichung
label: has number of pages @en
range: integer

hat Objekt-Erschaffungs-Typ
type: ObjectProperty
comment: Relation between an event in which an object is created and the type of this creation.
domain: Objekt-Erschaffung
label: has object creation type @en
range: Objekt-Erschaffungs-Typ

hat Objekt-Erschaffungs-Typ - invers
type: ObjectProperty
comment: Inverse relation to has_object_creation_type.
label: has object creation type - inverse @en
inverse of: hat Objekt-Erschaffungs-Typ

hat Objekt-Zerstörungs-Typ
type: ObjectProperty
comment: Relation between an event in which an object is destroyed and the type of this destruction.
domain: Objekt-Zerstörung
label: has object destruction type @en
range: Objekt-Zerstörungs-Typ

hat Objekt-Zerstörungs-Typ - invers
type: ObjectProperty
comment: Inverse relation to has_object_destruction_type.
label: has object destruction type - inverse @en
inverse of: hat Objekt-Zerstörungs-Typ

hat Objekt-Modifikations-Typ
type: ObjectProperty
comment: Relation between an event in which an object is modified and the type of this modification.
domain: Objekt-Modifikation
label: has object modification type @en
range: Objekt-Modifikations-Typ

hat Objekt-Modifikations-Typ - invers
type: ObjectProperty
comment: Inverse relation to has_object_modification_type.
label: has object modification type - inverse @en
inverse of: hat Objekt-Modifikations-Typ

hat Objekt-Relation
type: ObjectProperty
comment: Links an entity to a relation-entity which is itself connected to an object.
domain: Entität mit Objekt-Relation
label: has object relation @en
range: Objekt-Relation

hat Objekt-Relation - invers
type: ObjectProperty
comment: Inverse relation to has_object_relation.
label: has object relation - inverse @en
inverse of: hat Objekt-Relation

hat Objekt-Typ
type: ObjectProperty
comment: Relation between an object and its type.
domain: Objekt
label: has object type @en
range: Objekt-Typ

hat Objekt-Typ - invers
type: ObjectProperty
comment: Inverse relation to has_object_type.
label: has object type - inverse @en
inverse of: hat Objekt-Typ

hat Beruf
type: ObjectProperty
comment: A relation linking an entity (person) to its occupation.
domain: Person
label: has occupation @en
range: Beruf

hat Beruf - invers
type: ObjectProperty
comment: Inverse relation to has_occupation.
label: has occupation - inverse @en
inverse of: hat Beruf

hat Berufs-Wert
type: ObjectProperty
comment: Property with the actual occupation-value of an occupation-relation.
domain: Entität mit Beruf
label: has occupation value @en
range: occupation value

hat Berufs-Wert - invers
type: ObjectProperty
comment: Inverse relation to has_occupation_value.
label: has occupation value - inverse @en
inverse of: hat Berufs-Wert

hat Teilnehmer:in
type: ObjectProperty
comment: Relation between an event and one of its participants.
domain: Ereignis
label: has participant @en
range: Teilnehmer:in

hat Teilnehmer:in - invers
type: ObjectProperty
comment: Inverse relation to has_participant.
label: has participant - inverse @en
inverse of: hat Teilnehmer:in

hat Teilnehmer:in-Rolle
type: ObjectProperty
comment: Relation between an participant of an event and the role of this participant.
domain: Teilnehmer:in
label: has participant role @en
range: Teilnehmer:in-Rolle

hat Teilnehmer:in-Rolle - invers
type: ObjectProperty
comment: Inverse relation to has_participant_role.
label: has participant role - inverse @en
inverse of: hat Teilnehmer:in-Rolle

hat Teilnehmer:in-Wert
type: ObjectProperty
comment: Relation between a participant and the actual actor (e.g. a person) that participated.
domain: Teilnehmer:in
label: has participant value @en
range: Akteur

hat Teilnehmer:in-Wert - invers
type: ObjectProperty
comment: Inverse relation to has_participant_value.
label: has participant value - inverse @en
inverse of: hat Teilnehmer:in-Wert

hat Typ der Personen-Gruppen-Relation
type: ObjectProperty
comment: Property containing the type of a relation between a person and a group.
domain: Personen-Gruppen-Relation
label: has person group relation type @en
range: Typ der Personen-Gruppen-Relation

hat Typ der Personen-Gruppen-Relation - invers
type: ObjectProperty
comment: Inverse relation of has_person_group_relation_type.
label: has person group relation type - inverse @en
inverse of: hat Typ der Personen-Gruppen-Relation

hat Rolle in der Person-Person-Relation
type: ObjectProperty
comment: A relation for specifying the role of a person in a relation between persons further, used for asymetric person-person-relations like teacher and student, relates a triple (an RDF-statement) with this role-information.
domain: Triple
label: has person person relation role @en
range: Rolle in der Person-Person-Relation

hat Rolle in der Person-Person-Relation - invers
type: ObjectProperty
comment: Inverse relation to has_person_person_relation_role.
label: has person person relation role - inverse @en
inverse of: hat Rolle in der Person-Person-Relation

hat Typ der Person-Person-Relation
type: ObjectProperty
comment: Relates a relation between persons with its respective type, such as friendship.
domain: Person-Person-Relation
label: has person person relation type @en
range: Typ der Person-Person-Relation

hat Typ der Person-Person-Relation - invers
type: ObjectProperty
comment: Inverse relation to has_person_person_relation_type.
label: has person person relation type - inverse @en
inverse of: hat Typ der Person-Person-Relation

hat Personen-Orts-Relation-Typ
type: ObjectProperty
comment: A relation linking a relation-entity to its type of relation.
domain: Relation zwischen Person und Ort
label: has person place relation type @en
range: Personen-Orts-Relation-Typ

hat Personen-Orts-Relation-Typ - invers
type: ObjectProperty
comment: Inverse relation to has_person_place_relation.
label: has person place relation type - inverse @en
inverse of: hat Personen-Orts-Relation-Typ

hat Personenrelation
type: ObjectProperty
comment: Links an entity to a relation-entity which is itself connected to a person.
domain: Entität mit Personenrelation
label: has person relation @en
range: Personenrelation

hat Personenrelation - invers
type: ObjectProperty
comment: Inverse relation to has_person_relation.
label: has person relation - inverse @en
inverse of: hat Personenrelation

hat physische Instanz
type: ObjectProperty
comment: A relation between a publication and an object which is one of its physical instances.
domain: Veröffentlichung
label: has_physical instance @en
range: Objekt

hat physische Instanz - invers
type: ObjectProperty
comment: Inverse relation to has_physical_instance.
label: has_physical instance - inverse @en
inverse of: hat physische Instanz

hat Ort
type: ObjectProperty
comment: Relation linking an entity to a place.
domain: Entität mit Ort
label: has place @en
range: Ort

hat Ort - invers
type: ObjectProperty
comment: Inverse relation to has_place.
label: has place - inverse @en
inverse of: hat Ort

hat Ortsrelation
type: ObjectProperty
comment: Links an entity to a relation-entity which is itself connected to a place.
domain: Entität mit Ortsrelation
label: has place relation @en
range: Ortsrelation

hat Ortsrelation - invers
type: ObjectProperty
comment: Inverse relation to has_place_relation.
label: has place relation - inverse @en
inverse of: hat Ortsrelation

hat Art des Ortes
type: ObjectProperty
comment: A relation for specifying the type of a place.
domain: Ort
label: has place type @en
range: Art des Ortes

hat Art des Ortes - invers
type: ObjectProperty
comment: The inverse relation to has_place_type
label: has place type - inverse @en
inverse of: hat Art des Ortes

hat Postleitzahl
type: DatatypeProperty
comment: Relation between an address and its postcode.
domain: Adresse
label: has postcode @en
range: Literal

hat präferierten Namen
type: ObjectProperty
comment: Relationship between an entity and its preferred name, subproperty of has_name.
label: has preferred name @en
sub property of: hat Name

hat präferierten Namen - invers
type: ObjectProperty
comment: Inverse relation to has_preferred_name
label: has preferred name - inverse @en
inverse of: hat präferierten Namen

hat bevorzugten Titel
type: ObjectProperty
comment: A relation between an entity and its preferred title, subproperty of has_title.
label: has preferred title @en
sub property of: hat Titel

hat bevorzugten Titel - invers
type: ObjectProperty
comment: Inverse relation to has_preferred_title.
label: has preferred title - inverse @en
inverse of: hat bevorzugten Titel

hat Provenienz-URL
type: AnnotationProperty
comment: Property of a triple containing a URL as its provenance.
label: has provenance URL @en
sub property of: seeAlso
sub property of: hat Tripel-Wert

hat Provenienz-Sicherheit
type: AnnotationProperty
comment: Property of a triple describing how certain the statment is.
label: has provenance certainty @en
sub property of: hat Tripel-Wert

hat Provenienz-Beitragende:r
type: ObjectProperty
comment: Relation between a triple and a person or group that entered the information into the database.
domain: Triple
label: has provenance contributor @en
range: Akteur

hat Provenienz-Datensatz
type: AnnotationProperty
comment: Relation between a triple and and the IRI or URL of the dataset where the information was integrated from. This information is added automatically during import into Central Knowledge Graph
domain: Triple
label: has provenance dataset @en

hat Provenienz-Datum
type: DatatypeProperty
comment: Property of a triple containing the date it was entered into the database.
domain: Triple
label: has provenance date @en
range: Literal

hat Provenienz-Projekt
type: AnnotationProperty
comment: Relation between a triple and and the IRI of a project (e.g. from ProjekteVZ) that created it. This information is added automatically during import into Central Knowledge Graph
domain: Triple
label: has provenance project @en

hat Provenienz-Ressource
type: AnnotationProperty
comment: Property of a triple containing a link to an IRI as its provenance.
domain: Triple
label: has provenance resource @en

hat Provenienz-Text
type: AnnotationProperty
comment: Property of a triple containing a textual description of its provenance.
label: has provenance text @en
sub property of: hat Tripel-Wert

hat Publisher
type: ObjectProperty
comment: A relation between an a publication and its publisher, the publisher can be any actor (person or group).
domain: Veröffentlichung
label: has publisher @en
range: Akteur

hat Publisher - invers
type: ObjectProperty
comment: Inverse relation to has_publisher.
label: has publisher - inverse @en
inverse of: hat Publisher

hat assoziierte Gruppe
type: ObjectProperty
comment: Relation between an existential event for groups (beginning, end, change of existence) and a second group that is involved, such as the larger club another club is incorporated into.
domain: Änderung der Existenz
label: has related group @en
range: Gruppe

hat assoziierte Gruppe - invers
type: ObjectProperty
comment: Inverse relation to has_related_group.
label: has related group - inverse @en
inverse of: hat assoziierte Gruppe

hat assoziierten Ort
type: ObjectProperty
comment: Relation between an existential event for places (beginning, end, change of existence) and a second place that is involved, such as the city a village is incorporated into.
domain: Änderung der Existenz
label: has related place @en
range: Ort

hat assoziierten Ort - invers
type: ObjectProperty
comment: Inverse relation to has_related_place.
label: has related place - inverse @en
inverse of: hat assoziierten Ort

hat Ressourcen-Relation
type: ObjectProperty
comment: Links an entity to a relation-entity which is itself connected to a resource.
domain: Entität mit Ressourcen-Relation
label: has resource relation @en
range: Ressourcen-Relation

hat Ressourcen-Relation - invers
type: ObjectProperty
comment: Inverse relation to has_resource_relation.
label: has resource relation - inverse @en
inverse of: hat Ressourcen-Relation

hat Schreibsystem
type: ObjectProperty
comment: Relation between an entity and the writing script of its representation, such as Latin or Cyrillic.
domain: Entität mit Schreibsystem
label: has script @en
range: Schreibsystem

hat Schreibsystem - invers
type: ObjectProperty
comment: Inverse relation to has_script.
label: has script - inverse @en
inverse of: hat Schreibsystem

hat Straßenadresse
type: DatatypeProperty
comment: Relation between an address-object and its actual street address as a literal.
domain: Adresse
label: has street address @en
range: Literal

hat Thema oder Gegenstand
type: ObjectProperty
comment: Relation between an object and its subject.
domain: Objekt
label: has subject @en
range: Thema oder Gegenstand

hat Themenbereich
type: ObjectProperty
comment: A relation between an entity of class work and its subject area.
domain: Werk
label: has_subject area @en
range: Themenbereich

hat Themenbereich - invers
type: ObjectProperty
comment: Inverse relation to has_subject_area.
label: has_subject area - inverse @en
inverse of: hat Themenbereich

hat Thema oder Gegenstand - invers
type: ObjectProperty
comment: Inverse relation to has_subject.
label: has subject - inverse @en
inverse of: hat Thema oder Gegenstand

hat Typ der Thema-Relation
type: ObjectProperty
comment: Relation between the subject of an object and its type.
domain: Thema oder Gegenstand
label: has subject relation type @en
range: Typ der Thema-Relation

hat Typ der Thema-Relation - invers
type: ObjectProperty
comment: Inverse relation to has_subject_relation_type.
label: has subject relation type - inverse @en
inverse of: hat Typ der Thema-Relation

hat Thema-Wert
type: ObjectProperty
comment: Relation between the subject of an object an entity (of any class in the knowledge graph) representing this subject.
domain: Thema oder Gegenstand
label: has subject value @en

hat Thema-Wert - invers
type: ObjectProperty
comment: Inverse relation to has_subject_value.
label: has subject value - inverse @en
inverse of: hat Thema-Wert

hat anschließendes Event
type: ObjectProperty
comment: Relation between two events where one event is subsequent to the other.
domain: Ereignis
label: has subsequent event @en
range: Ereignis

hat anschließendes Event - invers
type: ObjectProperty
comment: Inverse relation to has_subsequent_event.
label: has subsequent event - inverse @en
inverse of: hat anschließendes Event

hat Titel
type: ObjectProperty
comment: A relation between an entity and its title.
domain: Entität mit Titel
label: has title @en
range: Titel

hat Titel - invers
type: ObjectProperty
comment: Inverse relation to has_title.
label: has title - inverse @en
inverse of: hat Titel

hat Titel-Wert
type: AnnotationProperty
type: DatatypeProperty
comment: A relation between a title and its actual value.
domain: Titel
label: has title value @en
range: langString
sub property of: hat Hauptwert

hat Thema
type: ObjectProperty
comment: Relation between an event and its topic.
domain: Ereignis
label: has topic @en
range: Thema

hat Thema - invers
type: ObjectProperty
comment: Inverse relation to has_topic.
label: has topic - inverse @en
inverse of: hat Thema

hat Tripel-Wert
type: AnnotationProperty
comment: General super-property for all properties having a triple as their domain and a literal as their range.
domain: Triple
label: has triple value @en
range: Literal
sub property of: hat Wert

hat Wert
type: AnnotationProperty
comment: Relation between an entity and a value.
label: has value @en
range: Literal

hat Typ des Werks
type: ObjectProperty
comment: A relation between an entity of class work and its type.
domain: Werk
label: has work type @en
range: Typ des Werks

hat Typ des Werks - invers
type: ObjectProperty
comment: Inverse relation to has_work_type.
label: has work type - inverse @en
inverse of: hat Typ des Werks

ID
type: Class
comment: An identifier for an entity, such as GND or wikidata IDs.
label: id @en
subclass of: Entität mit Name

ID-Typ
type: Class
comment: The type of an identifier, the instituion or website issuing it, such as GND or Wikidata.
label: id type @en
subclass of: Entität mit Beschreibung
subclass of: Entität mit Name

Inschrift
type: Class
comment: An inscription, subclass of object, can be related to objects using is_part_of_object relation.
label: inscription @en
subclass of: Objekt

ist Teil des Events
type: ObjectProperty
comment: Relation between two events where one event is part of the other.
domain: Ereignis
label: is part of event @en
range: Ereignis

ist Teil des Events - invers
type: ObjectProperty
comment: Inverse relation to is_part_of_event.
label: is part of event - inverse @en
inverse of: ist Teil des Events

ist Teil der Gruppe
type: ObjectProperty
comment: Relates a group to a relation-object, which expresses that one group is part of the other.
domain: Gruppe
label: is part of group @en
range: Teil der Gruppe-Relation

ist Teil der Gruppe - invers
type: ObjectProperty
comment: Inverse relation to is_part_of_group.
label: is part of group - inverse @en
inverse of: ist Teil der Gruppe

ist Teil des Objekts
type: ObjectProperty
comment: Relation between two objects where one is part of the other.
domain: Objekt
label: is part of object @en
range: Objekt

ist Teil des Objekts - invers
type: ObjectProperty
comment: Inverse relation to is_part_of_object.
label: is part of object - inverse @en
inverse of: ist Teil des Objekts

ist Teil des Ortes
type: ObjectProperty
comment: A relation between a place and a part_of_place_relation, specifies that the specific place is part of another place.
domain: Ort
label: is part of place @en
range: Teil des Ortes-Relation

ist Teil des Ortes - invers
type: ObjectProperty
comment: Inverse relation to is_part_of_place.
label: is part of place - inverse @en
inverse of: ist Teil des Ortes

ist Teil des Werks
type: ObjectProperty
comment: A relation between two entities of class work where one is part of the other.
domain: Werk
label: is part of work @en
range: Werk

ist Teil des Werks - invers
type: ObjectProperty
comment: Inverse relation to is_part_of_work.
label: is part of work - inverse @en
inverse of: ist Teil des Werks

ist veröffentlicht
type: ObjectProperty
comment: A relation between an entity of class work and its publication.
domain: Werk
label: is published @en
range: Veröffentlichung

ist veröffentlicht - invers
type: ObjectProperty
comment: Inverse relation to is_published.
label: is published - inverse @en
inverse of: ist veröffentlicht

selbe Entität wie externe Referenz
type: DatatypeProperty
comment: Property containing a link to external reference (URL) about the entity, such as wikipedia-entries.
domain: Entität mit externer Referenz
label: is same as external reference @en
range: anyURI

Lizenz
type: Class
comment: The license of a publication.
label: license @en
subclass of: Entität mit Beschreibung
subclass of: Entität mit Name

Lebensstatusänderung
type: Class
comment: A class consisting of birth and death events.
label: life state change @en
subclass of: Entität mit Beschreibung
subclass of: Entität mit Name
subclass of: Entität mit Ort
subclass of: Entität mit Zeitpunkt

Standort
type: Class
comment: The location of an entity, can be related to a place, can be further described using a timespan.
label: location @en
subclass of: Entität mit Beschreibung
subclass of: Entität mit Ort
subclass of: Entität mit Zeitspanne
property:
  min count: 1
  path:
    inverse path: hat Standort
property:
  min count: 1
  path: hat Ort

Material
type: Class
comment: The material of an object.
label: material @en
subclass of: Entität mit Beschreibung
subclass of: Entität mit Name

Name
type: Class
comment: The name-object of an entity.
label: name @en
subclass of: Entität mit (akad.) Titel
subclass of: Entität mit Schreibsystem
subclass of: Entität mit Zeitspanne

Nationalität
type: Class
comment: The nationality of an entity. Can be limited in time.
label: nationality @en
subclass of: Entität mit Zeitspanne

Nationalitätenwert
type: Class
comment: The actual nationality value of an entity, subclass of place, only countries should be used.
label: nationality value @en
subclass of: Ort

Objekt
type: Class
comment: Any kind of physical object like pieces of art or monuments.
label: object @en
subclass of: Entität mit Akteur-Relation
subclass of: Entität mit Zitation
subclass of: Entität mit Beschreibung
subclass of: Entität mit externer Referenz
subclass of: Entität mit ID
subclass of: Entität mit Ort
subclass of: Entität mit Name
subclass of: Ressource

Objekt-Erschaffung
type: Class
comment: An event in which an object is created.
label: object creation @en
subclass of: Entität mit Objekt
subclass of: Ereignis

Objekt-Erschaffungs-Typ
type: Class
comment: The type of creation of an object.
label: object creation type @en
subclass of: Entität mit Beschreibung
subclass of: Entität mit Name

Objekt-Zerstörung
type: Class
comment: An event in which an object is destroyed.
label: object destruction @en
subclass of: Entität mit Objekt
subclass of: Ereignis

Objekt-Zerstörungs-Typ
type: Class
comment: The type of destruction in an event in which an object is destroyed.
label: object destruction type @en
subclass of: Entität mit Beschreibung
subclass of: Entität mit Name

Objekt-Modifikation
type: Class
comment: An event in which an object is modified.
label: object modification @en
subclass of: Entität mit Objekt
subclass of: Ereignis

Objekt-Modifikations-Typ
type: Class
comment: The type of modification of an event in which an object is modified.
label: object modification type @en
subclass of: Entität mit Beschreibung
subclass of: Entität mit Name

Objekt-Relation
type: Class
comment: Internal superclass, relations where one participant is an object.
label: object relation @en

Objekt-Typ
type: Class
comment: The type of an object.
label: object type @en
subclass of: Entität mit Beschreibung
subclass of: Entität mit Name

Beruf
type: Class
comment: The occupation of an entity. Can be linked to a timeframe, a name, a description and the actual occupation value.
label: occupation @en
subclass of: Entität mit Beschreibung
subclass of: Entität mit Name
subclass of: Entität mit Beruf
subclass of: Entität mit Zeitspanne

occupation value
type: Class
comment: The actual occupation-value of an occupation-relation. Use of a respective vocabulary such as HISCO is recommended.
subclass of: Entität mit Name
subclass of: ID

Teil der Gruppe-Relation
type: Class
comment: Relates two groups and expresses that one group is part of the other.
label: part of group relation @en
subclass of: Entität mit Beschreibung
subclass of: Entität mit Gruppe
subclass of: Entität mit Zeitspanne
property:
  min count: 1
  path:
    inverse path: ist Teil der Gruppe
property:
  min count: 1
  path: hat Gruppe

Teil des Ortes-Relation
type: Class
comment: Central entity for describing a relation between two places where one is the part of the other. has_place-relation is used to link to the hypernym.
label: part of place relation @en
subclass of: Entität mit Beschreibung
subclass of: Entität mit Ort
subclass of: Entität mit Zeitspanne
property:
  min count: 1
  path:
    inverse path: ist Teil des Ortes
property:
  min count: 1
  path: hat Ort

Teilnehmer:in
type: Class
comment: An participant of an event, needs to be related to an actor such as a person, can be further described with a timespan.
label: participant @en
subclass of: Entität mit Beschreibung
subclass of: Entität mit Zeitspanne

Teilnehmer:in-Rolle
type: Class
comment: The role a participant has in an event.
label: participant_role @en
subclass of: Entität mit Beschreibung
subclass of: Entität mit Name

Person
type: Class
comment: A human being.
label: person @en
subclass of: Akteur
subclass of: Entität mit Zitation
subclass of: Entität mit Beschreibung
subclass of: Entität mit externer Referenz
subclass of: Entität mit Gruppenrelation
subclass of: Entität mit ID
subclass of: Entität mit Name
subclass of: Entität mit Personenrelation
subclass of: Entität mit Ortsrelation

Personen-Gruppen-Relation
type: Class
comment: An entity that representing a relation where a group and a person play a central role, such as a membership.
label: person group relation @en
subclass of: Entität mit (akad.) Titel
subclass of: Entität mit Beschreibung
subclass of: Entität mit Name
subclass of: Entität mit Beruf
subclass of: Entität mit Zeitspanne
subclass of: Gruppenrelation
subclass of: Personenrelation

Typ der Personen-Gruppen-Relation
type: Class
comment: The type of a relation between a person and a group, for example a membership, attendance at a school or university.
label: person group relation type @en
subclass of: Entität mit Beschreibung
subclass of: Entität mit Name

Person-Person-Relation
type: Class
comment: An entity representing a relation where (at least) two persons play a central role.
label: person person relation @en
subclass of: Entität mit Beschreibung
subclass of: Entität mit Name
subclass of: Entität mit Zeitspanne
subclass of: Personenrelation

Rolle in der Person-Person-Relation
type: Class
comment: The role of a person in a relation between persons, used for asymetric person-person-relations like teacher and student.
label: person person relation role @en
subclass of: Entität mit Beschreibung
subclass of: Entität mit Name

Typ der Person-Person-Relation
type: Class
comment: The type of a relation between persons, such as friendship.
label: person person relation type @en
subclass of: Entität mit Beschreibung
subclass of: Entität mit Name

Relation zwischen Person und Ort
type: Class
comment: An entity representing a relation where a place and a person play a central role.
label: person place relation @en
subclass of: Entität mit Beschreibung
subclass of: Entität mit Name
subclass of: Entität mit Zeitspanne
subclass of: Personenrelation
subclass of: Ortsrelation

Personen-Orts-Relation-Typ
type: Class
comment: The type of a relation between a place and a person.
label: person place relation type @en
subclass of: Entität mit Beschreibung
subclass of: Entität mit Name

Personenrelation
type: Class
comment: Internal superclass, all relations where one participant is a person.
label: person relation @en

physisches Werk
type: Class
comment: When a work is not an abstract entity (such as Goethe's Faust) but is one with it's physical form like letters, files or records in an archive
label: physical work @en
subclass of: Objekt
subclass of: Werk

Ort
type: Class
comment: A general geographic entity, can range from countries to cities or districts to buildings.
label: place @en
subclass of: Entität mit Zitation
subclass of: Entität mit Beschreibung
subclass of: Entität mit Existenzveränderung
subclass of: Entität mit externer Referenz
subclass of: Entität mit ID
subclass of: Entität mit Name
subclass of: Entität mit Personenrelation

Ortsrelation
type: Class
comment: Internal superclass, all relations where one participant is a place.
label: place relation @en

Art des Ortes
type: Class
comment: Specifies the type of a place, e.g. country, federal state, street.
label: place type @en
subclass of: Entität mit Beschreibung
subclass of: Entität mit Name

Veröffentlichung
type: Class
comment: The publication of an entity of class work.
label: publication @en
subclass of: Entität mit Beschreibung
subclass of: Entität mit Name
subclass of: Entität mit Ort
subclass of: Entität mit Zeitpunkt

veröffentlichtes Werk
type: Class
comment: Works to be seen as one with their publication if there is no need for a separation
label: published work @en
subclass of: Veröffentlichung
subclass of: Werk

Ressource
type: Class
comment: Any kind of resource, superclass of object and work.
label: resource @en
subclass of: Entität mit Event-Relation

Ressourcen-Relation
type: Class
comment: Internal superclass, relations where one participant is a resource.
label: resource relation @en

Schreibsystem
type: Class
comment: The writing script of an entity.
label: script @en
subclass of: Entität mit Beschreibung
subclass of: Entität mit Name

Thema oder Gegenstand
type: Class
comment: The subject of an object.
label: subject @en
subclass of: Entität mit Beschreibung
subclass of: Entität mit Name

Themenbereich
type: Class
comment: The subject area of an entity of class work.
label: subject area @en
subclass of: Entität mit Beschreibung
subclass of: Entität mit ID
subclass of: Entität mit Name

Typ der Thema-Relation
type: Class
comment: The type of a subject of an object.
label: subject relation type @en
subclass of: Entität mit Beschreibung
subclass of: Entität mit Name

Titel
type: Class
comment: The title of an entity.
label: title @en
subclass of: Entität mit Schreibsystem
subclass of: Entität mit Zeitspanne

Thema
type: Class
comment: The topic an event is about.
label: topic @en
subclass of: Entität mit Beschreibung
subclass of: Entität mit Name

Werk
type: Class
comment: Different types of written works, such as books, scientific papers, event programs.
label: work @en
subclass of: Entität mit Autor
subclass of: Entität mit Zitation
subclass of: Entität mit Beschreibung
subclass of: Entität mit externer Referenz
subclass of: Entität mit Gruppenrelation
subclass of: Entität mit ID
subclass of: Entität mit Zeitspanne
subclass of: Entität mit Titel
subclass of: Ressource

Typ des Werks
type: Class
comment: The type of an entity of the class work.
label: work type @en
subclass of: Entität mit Beschreibung
subclass of: Entität mit Name