DIKUSA Core Ontology
type: Ontology
description: The DIKUSA core ontology is used for the linking of digital cultural data of research projects in Saxony, Germany. It is applied by six Saxon non-university DH research institutions within the DIKUSA-project (Vernetzung digitaler Kulturdaten in Sachsen). It is used as a common core ontology to harmonize the data of the partners which internally use their own specialized ontology for creating research-related knowledge bases. Central categories of the ontology are person, place, group, object, bibliographic item and event. The ontology is provided as an RDF(star)-file in turtle-format. Shacl-constraints for validation of knowledge bases against the schema are included.
license: https://www.gnu.org/licenses/agpl-3.0.en.html

has begin earliest
type: AnnotationProperty
comment: Relation linking an entity to the beginning of a period of time, specifically the earliest possible beginning.
label: hat frühesten Beginn @de
sub property of: has value
range: Literal
domain: timeframe related entity

has begin latest
type: AnnotationProperty
comment: Relation linking an entity to the beginning of a period of time, specifically the latest possible beginning.
label: hat spätesten Beginn @de
sub property of: has value
range: Literal
domain: timeframe related entity

has citation resource
type: AnnotationProperty
sub property of: value
type: ObjectProperty
domain: citation
range: work
comment: A relation between a citation and the resource where this citation is to be found.
label: hat Zitationsressource @de

has citation text
type: AnnotationProperty
comment: A relation between a citation and a string which represents the text of interest.
label: hat Zitationstext @de
sub property of: has value
range: string
domain: citation

has comment
type: AnnotationProperty
comment: Property of a triple containing a general comment about the statement.
label: hat Kommentar @de
sub property of: comment
sub property of: has triple value

has date earliest
type: AnnotationProperty
comment: Relation linking an entity to a timepoint, specifically the earliest possible one.
label: hat frühestes Datum @de
sub property of: has value
range: Literal
domain: timepoint related entity

has date latest
type: AnnotationProperty
comment: Relation linking an entity to a timepoint, specifically the latest possible one.
label: hat spätestes Datum @de
sub property of: has value
range: Literal
domain: timepoint related entity

has description
type: AnnotationProperty
comment: Property of a triple containing a description of the statement.
label: hat Beschreibung @de
sub property of: has triple value

has end earliest
type: AnnotationProperty
comment: Relation linking an entity to the end of a period of time, specifically the earliest possible end.
label: hat frühestes Ende @de
sub property of: has value
range: Literal
domain: timeframe related entity

has end latest
type: AnnotationProperty
comment: Relation linking an entity to the end of a period of time, specifically the latest possible end.
label: hat spätestes Ende @de
sub property of: has value
range: Literal
domain: timeframe related entity

has entity description value
type: AnnotationProperty
comment: Property containing the value of an entity_description.
label: hat Entitätenbeschreibungs-Wert @de
sub property of: has main value
domain: entity description

has id value
type: AnnotationProperty
sub property of: has main value
type: DatatypeProperty
domain: id
range: string
comment: The actual alphanumerical value of the identifier, such as the identifier 134597990 taken from GND.
label: hat ID-Wert @de

has main value
type: AnnotationProperty
comment: Relation between an entity and its central value, if such a feature exists.
label: hat Hauptwert @de
sub property of: value
sub property of: has value

has name value
type: AnnotationProperty
sub property of: has main value
type: DatatypeProperty
domain: name
range: langString
comment: Relation between a name and its value (string).
label: hat Namenswert @de

has provenance URL
type: AnnotationProperty
comment: Property of a triple containing a URL as its provenance.
label: hat Provenienz-URL @de
sub property of: seeAlso
sub property of: has triple value

has provenance certainty
type: AnnotationProperty
comment: Property of a triple describing how certain the statment is.
label: hat Provenienz-Sicherheit @de
sub property of: has triple value

has provenance dataset
type: AnnotationProperty
comment: Relation between a triple and and the IRI or URL of the dataset where the information was integrated from. This information is added automatically during import into Central Knowledge Graph
label: hat Provenienz-Datensatz @de
domain: Triple

has provenance project
type: AnnotationProperty
comment: Relation between a triple and and the IRI of a project (e.g. from ProjekteVZ) that created it. This information is added automatically during import into Central Knowledge Graph
label: hat Provenienz-Projekt @de
domain: Triple

has provenance resource
type: AnnotationProperty
comment: Property of a triple containing a link to an IRI as its provenance.
label: hat Provenienz-Ressource @de
domain: Triple

has provenance text
type: AnnotationProperty
comment: Property of a triple containing a textual description of its provenance.
label: hat Provenienz-Text @de
sub property of: has triple value

has title value
type: AnnotationProperty
sub property of: has main value
type: DatatypeProperty
domain: title
range: langString
comment: A relation between a title and its actual value.
label: hat Titel-Wert @de

has triple value
type: AnnotationProperty
comment: General super-property for all properties having a triple as their domain and a literal as their range.
label: hat Tripel-Wert @de
sub property of: has value
range: Literal
domain: Triple

has value
type: AnnotationProperty
comment: Relation between an entity and a value.
label: hat Wert @de
range: Literal

has actor object relation type
type: ObjectProperty
domain: actor object relation
range: actor object relation type
comment: Relation between a relation of an actor and an object and its type.
label: hat Akteur-Objekt-Relation-Typ @de

has actor object relation type - inverse
type: ObjectProperty
inverse of: has actor object relation type
comment: Inverse relation to has_actor_object_relation_type.
label: hat Akteur-Objekt-Relation-Typ - invers @de

has actor relation
type: ObjectProperty
domain: entity with actor relation
range: actor relation
comment: Links an entity to a relation-entity which is itself connected to an actor (person or group).
label: hat Akteur-Relation @de

has actor relation - inverse
type: ObjectProperty
inverse of: has actor relation
comment: Inverse relation to has_actor_relation.
label: hat Akteur-Relation - invers @de

has address
type: ObjectProperty
domain: place
range: address
comment: Relation between a place and its adress.
label: hat Adresse @de

has address - inverse
type: ObjectProperty
inverse of: has address
comment: Inverse relation to has_address.
label: hat Adresse - invers @de

has alternative name
type: ObjectProperty
sub property of: has name
comment: Relationship between an entity and its alternative name, subproperty of has_name.
label: hat alternativen Namen @de

has alternative name - inverse
type: ObjectProperty
inverse of: has alternative name
comment: Inverse relation to has_alternative_name.
label: hat alternativen Namen - invers @de

has alternative title
type: ObjectProperty
sub property of: has title
comment: A relation between an entity and its alternative title, subproperty of title.
label: hat alternativen Titel @de

has alternative title - inverse
type: ObjectProperty
inverse of: has alternative title
comment: Inverse relation to has_alternative_title.
label: hat alternativen Titel - invers @de

has author
type: ObjectProperty
domain: entity with author
range: author
comment: Relation linking an entity to its author.
label: hat Autor @de

has author - inverse
type: ObjectProperty
inverse of: has author
comment: Inverse relation to has_author.
label: hat Autor - invers @de

has author role
type: ObjectProperty
domain: author
range: author role
comment: Relation between an author and its role in the authoring process.
label: hat Autorenrolle @de

has author role - inverse
type: ObjectProperty
inverse of: has author role
comment: Inverse relation to has_author_role.
label: hat Autorenrolle - invers @de

has author value
type: ObjectProperty
domain: author
range: actor
comment: Relation linking an author entity to the actual person or group that did the authoring.
label: hat Autorenwert @de

has author value - inverse
type: ObjectProperty
inverse of: has author value
comment: Inverse relation to has_author_value.
label: hat Autorenwert - invers @de

has begin of existence
type: ObjectProperty
domain: entity with existence change
range: change of existence
comment: Relation between entities (mainly geographical ones like cities, countries or group entities) and the event that is marked as the beginning of their existence.
label: hat Beginn der Existenz @de

has begin of existence - inverse
type: ObjectProperty
inverse of: has begin of existence
comment: Inverse relation to has_begin_of_existence.
label: hat Beginn der Existenz - invers @de

has birth
type: ObjectProperty
sub property of: has life state change
comment: Relation linking an entity to its birth event.
label: hat Geburtsereignis @de

has birth - inverse
type: ObjectProperty
inverse of: has birth
comment: Inverse relation to has_birth.
label: hat Geburt - invers @de

has change of existence
type: ObjectProperty
domain: entity with existence change
range: change of existence
comment: Relation between entities (mainly geographical ones like cities, countries or group entities) and the event that is marked as a change to their existence, like the incorporation of a place into another one.
label: hat Änderung der Existenz @de

has change of existence - inverse
type: ObjectProperty
inverse of: has change of existence
comment: Inverse relation to has_change_of_existence.
label: hat Änderung der Existenz - invers @de

has change of group existence type
type: ObjectProperty
domain: change of existence
range: change of group existence type
comment: Relation to the type of an event that is marked as the beginning, end or as a change of the existence of an entity of type group, like founding, dissolution.
label: hat Typ der Änderung der Existenz einer Gruppe @de

has change of group existence type - inverse
type: ObjectProperty
inverse of: has change of group existence type
comment: Inverse relation to has_change_of_group_existence_type.
label: hat Typ der Änderung der Existenz einer Gruppe - invers @de

has change of place existence type
type: ObjectProperty
domain: change of existence
range: change of place existence type
comment: Relation to the type of an event that is marked as the beginning, end or as a change of the existence of an entity of type place.
label: hat Typ der Änderung der Existenz eines Ortes @de

has change of place existence type - inverse
type: ObjectProperty
inverse of: has change of place existence type
comment: Inverse relation to has_change_of_place_existence_type.
label: hat Typ der Änderung der Existenz eines Ortes - invers @de

has citation
type: ObjectProperty
domain: entity with citation
range: citation
comment: A relation between an entity and a citation where the entity is mentioned.
label: hat Zitation @de

has citation - inverse
type: ObjectProperty
inverse of: has citation
comment: Inverse relation to has_citation.
label: hat Zitation - invers @de

has citation resource - inverse
type: ObjectProperty
inverse of: has citation resource
comment: Inverse relation to has_citation_resource.
label: hat Zitationsressource - invers @de

has city
type: ObjectProperty
domain: address
range: place
comment: Relation between an address and the city it is situated in.
label: hat Stadt @de

has city - inverse
type: ObjectProperty
inverse of: has city
comment: Inverse relation to has_city.
label: hat Stadt - invers @de

has coordinates
type: ObjectProperty
domain: place
range: coordinates
comment: Relation between a place and its geographical coordinates.
label: hat Koordinaten @de

has coordinates - inverse
type: ObjectProperty
inverse of: has coordinates
comment: Inverse relation to has_coordinates.
label: hat Koordinaten - invers @de

has country
type: ObjectProperty
domain: address
range: place
comment: Relation between an address and the country it is situated in.
label: hat Land @de

has country - inverse
type: ObjectProperty
inverse of: has country
comment: Inverse relation to has_country.
label: hat Land - invers @de

has death
type: ObjectProperty
sub property of: has life state change
comment: Relation linking an entity to its death event.
label: hat Todesereignis @de

has death - inverse
type: ObjectProperty
inverse of: has death
comment: Inverse relation to has_death.
label: hat Todesereignis - invers @de

has dimension
type: ObjectProperty
domain: object
range: dimension
comment: Relation between an object and one of its dimensions (containing e.g. informations about its height).
label: hat Dimension @de

has dimension - inverse
type: ObjectProperty
inverse of: has dimension
comment: Inverse relation to has_dimension.
label: hat Dimension - invers @de

has dimension type
type: ObjectProperty
domain: dimension
range: dimension type
comment: Relation of the dimension of an object with the type of this dimension (could be height, width, diameter, ...).
label: hat Dimensions-Typ @de

has dimension type - inverse
type: ObjectProperty
inverse of: has dimension type
comment: Inverse relation to has_dimension_type.
label: hat Dimensions-Typ - invers @de

has dimension unit
type: ObjectProperty
domain: dimension
range: dimension unit
comment: Relation of the dimension of an object with the unit of this dimension.
label: hat Dimensions-Einheit @de

has dimension unit - inverse
type: ObjectProperty
inverse of: has dimension unit
comment: Inverse relation to has_dimension_unit.
label: hat Dimensions-Einheit - invers @de

has end of existence
type: ObjectProperty
domain: entity with existence change
range: change of existence
comment: Relation between entities (mainly geographical ones like cities, countries or group entities) and the event that is marked as the end of their existence.
label: hat Ende der Existenz @de

has end of existence - inverse
type: ObjectProperty
inverse of: has end of existence
comment: Inverse relation to has_end_of_existence.
label: hat Ende der Existenz - invers @de

has entity-description
type: ObjectProperty
domain: entity with description
range: entity description
comment: Relation of an entity linking it to an object containing its general description.
label: hat Entitätenbeschreibung @de

has description - inverse
type: ObjectProperty
inverse of: has entity-description
comment: Inverse relation to has_entity_description
label: hat Beschreibung - invers @de

has event event relation type
type: ObjectProperty
domain: event event relation
range: event event relation type
comment: Relation between a relation (of 2 events) and its type.
label: hat Event-Event-Relationen-Typ @de

has event event relation type - inverse
type: ObjectProperty
inverse of: has event event relation type
comment: Inverse relation to has_event_event_relation_type.
label: hat Event-Event-Relationen-Typ - invers @de

has event relation
type: ObjectProperty
domain: entity with event relation
range: event relation
comment: Links an entity to a relation-entity which is itself connected to an event.
label: hat Event-Relation @de

has event relation - inverse
type: ObjectProperty
inverse of: has event relation
comment: Inverse relation to has_event_relation.
label: hat Event-Relation - invers @de

has event resource relation type
type: ObjectProperty
domain: event resource relation
range: event resource relation type
comment: Relation between a relation of an event and a resource and its type.
label: hat Event-Ressourcen-Relationen-Typ @de

has event resource relation type - inverse
type: ObjectProperty
inverse of: has event resource relation type
comment: Inverse relation to has_event_resource_relation_type.
label: hat Event-Ressourcen-Relationen-Typ - invers @de

has event type
type: ObjectProperty
domain: event
range: event type
comment: Relation between an event and its type.
label: hat Eventtyp @de

has event type - inverse
type: ObjectProperty
inverse of: has event type
comment: Inverse relation to has_event_type.
label: hat Eventtyp - invers @de

has gender
type: ObjectProperty
domain: person
range: gender
comment: Relation between an entity (person) and its gender.
label: hat Geschlecht @de

has gender - inverse
type: ObjectProperty
inverse of: has gender
comment: Inverse relation to has_gender.
label: hat Geschlecht - invers @de

has gender value
type: ObjectProperty
domain: gender
range: gender value
comment: Property relating to the actual gender of type gender_value, preferably from LIDO gender actor vocabulary.
label: hat Geschlechter-Wert @de

has gender value - inverse
type: ObjectProperty
inverse of: has gender value
comment: Inverse relation to has_gender_value.
label: hat Geschlechter-Wert - invers @de

has group
type: ObjectProperty
domain: entity with group
range: group
comment: Relation linking an entity to a group.
label: hat Gruppe @de

has group - inverse
type: ObjectProperty
inverse of: has group
comment: Inverse relation to has_group.
label: hat Gruppe - invers @de

has group relation
type: ObjectProperty
domain: entity with group relation
range: group relation
comment: Links an entity to a relation-entity which is itself connected to a group.
label: hat Relation mit Gruppe @de

has group relation - inverse
type: ObjectProperty
inverse of: has group relation
comment: Inverse relation to has_group_relation.
label: hat Relation mit Gruppe - invers @de

has group type
type: ObjectProperty
domain: group
range: group type
comment: A relation between a group and its type.
label: hat Typ der Gruppe @de

has group type - inverse
type: ObjectProperty
inverse of: has group type
comment: Inverse relation to has_group_type.
label: hat Typ der Gruppe - invers @de

has id
type: ObjectProperty
domain: entity with id
range: id
comment: Relation between an entity and one of its identifiers.
label: hat ID @de

has id - inverse
type: ObjectProperty
inverse of: has id
comment: Inverse relation to has_id
label: hat ID - invers @de

has id type
type: ObjectProperty
domain: id
range: id type
comment: Relation to the type of an identifier.
label: hat ID-Typ @de

has id type - inverse
type: ObjectProperty
inverse of: has id type
comment: The inverse relation to has_id_type.
label: hat ID-Typ - invers @de

has license
type: ObjectProperty
domain: publication
range: license
comment: A relation between a publication and its license.
label: hat Lizenz @de

has license - inverse
type: ObjectProperty
inverse of: has license
comment: Inverse relation to has_license.
label: hat Lizenz - invers @de

has life state change
type: ObjectProperty
domain: person
range: life state change
comment: Change of life state, superclass to birth and death.
label: hat Lebensstatusänderung @de

has life state change - inverse
type: ObjectProperty
inverse of: has life state change
comment: Inverse relation to has_life_state_change.
label: hat Lebensstatusänderung - invers @de

has location
type: ObjectProperty
domain: entity with location
range: location
comment: Relation between an entity and its location.
label: hat Standort @de

has location - inverse
type: ObjectProperty
inverse of: has location
comment: Inverse relation to has_location.
label: hat Standort - invers @de

has material
type: ObjectProperty
domain: object
range: material
comment: Relation between an object and its material.
label: hat Material @de

has material - inverse
type: ObjectProperty
inverse of: has material
comment: Inverse relation to has_material.
label: hat Material - invers @de

has name
type: ObjectProperty
domain: entity with name
range: name
comment: Relationship between an entity and its name.
label: hat Name @de

has name - inverse
type: ObjectProperty
inverse of: has name
comment: Inverse Relation to has_name.
label: hat Name - invers @de

has nationality
type: ObjectProperty
domain: person
range: nationality
comment: Relation between an entity and its nationality.
label: hat Nationalität @de

has nationality - inverse
type: ObjectProperty
inverse of: has nationality
comment: Inverse relation to has_nationality.
label: hat Nationalität - invers @de

has nationality value
type: ObjectProperty
domain: nationality
range: nationality value
comment: Property containing the actual nationality value of an entity.
label: hat Nationalitätenwert @de

has nationality value - inverse
type: ObjectProperty
inverse of: has nationality value
comment: Inverse relation to has_nationality_value
label: hat Nationalitätenwert - invers @de

has object creation type
type: ObjectProperty
domain: object creation
range: object creation type
comment: Relation between an event in which an object is created and the type of this creation.
label: hat Objekt-Erschaffungs-Typ @de

has object creation type - inverse
type: ObjectProperty
inverse of: has object creation type
comment: Inverse relation to has_object_creation_type.
label: hat Objekt-Erschaffungs-Typ - invers @de

has object destruction type
type: ObjectProperty
domain: object destruction
range: object destruction type
comment: Relation between an event in which an object is destroyed and the type of this destruction.
label: hat Objekt-Zerstörungs-Typ @de

has object destruction type - inverse
type: ObjectProperty
inverse of: has object destruction type
comment: Inverse relation to has_object_destruction_type.
label: hat Objekt-Zerstörungs-Typ - invers @de

has object modification type
type: ObjectProperty
domain: object modification
range: object modification type
comment: Relation between an event in which an object is modified and the type of this modification.
label: hat Objekt-Modifikations-Typ @de

has object modification type - inverse
type: ObjectProperty
inverse of: has object modification type
comment: Inverse relation to has_object_modification_type.
label: hat Objekt-Modifikations-Typ - invers @de

has object relation
type: ObjectProperty
domain: entity with object relation
range: object relation
comment: Links an entity to a relation-entity which is itself connected to an object.
label: hat Objekt-Relation @de

has object relation - inverse
type: ObjectProperty
inverse of: has object relation
comment: Inverse relation to has_object_relation.
label: hat Objekt-Relation - invers @de

has object type
type: ObjectProperty
domain: object
range: object type
comment: Relation between an object and its type.
label: hat Objekt-Typ @de

has object type - inverse
type: ObjectProperty
inverse of: has object type
comment: Inverse relation to has_object_type.
label: hat Objekt-Typ - invers @de

has occupation
type: ObjectProperty
domain: person
range: occupation
comment: A relation linking an entity (person) to its occupation.
label: hat Beruf @de

has occupation - inverse
type: ObjectProperty
inverse of: has occupation
comment: Inverse relation to has_occupation.
label: hat Beruf - invers @de

has occupation value
type: ObjectProperty
domain: entity with occupation value
range: occupation value
comment: Property with the actual occupation-value of an occupation-relation.
label: hat Berufs-Wert @de

has occupation value - inverse
type: ObjectProperty
inverse of: has occupation value
comment: Inverse relation to has_occupation_value.
label: hat Berufs-Wert - invers @de

has participant
type: ObjectProperty
domain: event
range: participant
comment: Relation between an event and one of its participants.
label: hat Teilnehmer:in @de

has participant - inverse
type: ObjectProperty
inverse of: has participant
comment: Inverse relation to has_participant.
label: hat Teilnehmer:in - invers @de

has participant role
type: ObjectProperty
domain: participant
range: participant_role
comment: Relation between an participant of an event and the role of this participant.
label: hat Teilnehmer:in-Rolle @de

has participant role - inverse
type: ObjectProperty
inverse of: has participant role
comment: Inverse relation to has_participant_role.
label: hat Teilnehmer:in-Rolle - invers @de

has participant value
type: ObjectProperty
domain: participant
range: actor
comment: Relation between a participant and the actual actor (e.g. a person) that participated.
label: hat Teilnehmer:in-Wert @de

has participant value - inverse
type: ObjectProperty
inverse of: has participant value
comment: Inverse relation to has_participant_value.
label: hat Teilnehmer:in-Wert - invers @de

has person group relation type
type: ObjectProperty
domain: person group relation
range: person group relation type
comment: Property containing the type of a relation between a person and a group.
label: hat Typ der Personen-Gruppen-Relation @de

has person group relation type - inverse
type: ObjectProperty
inverse of: has person group relation type
comment: Inverse relation of has_person_group_relation_type.
label: hat Typ der Personen-Gruppen-Relation - invers @de

has person person relation role
type: ObjectProperty
domain: Triple
range: person person relation role
comment: A relation for specifying the role of a person in a relation between persons further, used for asymetric person-person-relations like teacher and student, relates a triple (an RDF-statement) with this role-information.
label: hat Rolle in der Person-Person-Relation @de

has person person relation role - inverse
type: ObjectProperty
inverse of: has person person relation role
comment: Inverse relation to has_person_person_relation_role.
label: hat Rolle in der Person-Person-Relation - invers @de

has person person relation type
type: ObjectProperty
domain: person person relation
range: person person relation type
comment: Relates a relation between persons with its respective type, such as friendship.
label: hat Typ der Person-Person-Relation @de

has person person relation type - inverse
type: ObjectProperty
inverse of: has person person relation type
comment: Inverse relation to has_person_person_relation_type.
label: hat Typ der Person-Person-Relation - invers @de

has person place relation type
type: ObjectProperty
domain: person place relation
range: person place relation type
comment: A relation linking a relation-entity to its type of relation.
label: hat Personen-Orts-Relation-Typ @de

has person place relation type - inverse
type: ObjectProperty
inverse of: has person place relation type
comment: Inverse relation to has_person_place_relation.
label: hat Personen-Orts-Relation-Typ - invers @de

has person relation
type: ObjectProperty
domain: entity with person relation
range: person relation
comment: Links an entity to a relation-entity which is itself connected to a person.
label: hat Personenrelation @de

has person relation - inverse
type: ObjectProperty
inverse of: has person relation
comment: Inverse relation to has_person_relation.
label: hat Personenrelation - invers @de

has_physical instance
type: ObjectProperty
domain: publication
range: object
comment: A relation between a publication and an object which is one of its physical instances.
label: hat physische Instanz @de

has_physical instance - inverse
type: ObjectProperty
inverse of: has_physical instance
comment: Inverse relation to has_physical_instance.
label: hat physische Instanz - invers @de

has place
type: ObjectProperty
domain: entity with place
range: place
comment: Relation linking an entity to a place.
label: hat Ort @de

has place - inverse
type: ObjectProperty
inverse of: has place
comment: Inverse relation to has_place.
label: hat Ort - invers @de

has place relation
type: ObjectProperty
domain: entity with place relation
range: place relation
comment: Links an entity to a relation-entity which is itself connected to a place.
label: hat Ortsrelation @de

has place relation - inverse
type: ObjectProperty
inverse of: has place relation
comment: Inverse relation to has_place_relation.
label: hat Ortsrelation - invers @de

has place type
type: ObjectProperty
domain: place
range: place type
comment: A relation for specifying the type of a place.
label: hat Art des Ortes @de

has place type - inverse
type: ObjectProperty
inverse of: has place type
comment: The inverse relation to has_place_type
label: hat Art des Ortes - invers @de

has preferred name
type: ObjectProperty
sub property of: has name
comment: Relationship between an entity and its preferred name, subproperty of has_name.
label: hat präferierten Namen @de

has preferred name - inverse
type: ObjectProperty
inverse of: has preferred name
comment: Inverse relation to has_preferred_name
label: hat präferierten Namen - invers @de

has preferred title
type: ObjectProperty
sub property of: has title
comment: A relation between an entity and its preferred title, subproperty of has_title.
label: hat bevorzugten Titel @de

has preferred title - inverse
type: ObjectProperty
inverse of: has preferred title
comment: Inverse relation to has_preferred_title.
label: hat bevorzugten Titel - invers @de

has provenance contributor
type: ObjectProperty
domain: Triple
range: actor
comment: Relation between a triple and a person or group that entered the information into the database.
label: hat Provenienz-Beitragende:r @de

has publisher
type: ObjectProperty
domain: publication
range: actor
comment: A relation between an a publication and its publisher, the publisher can be any actor (person or group).
label: hat Publisher @de

has publisher - inverse
type: ObjectProperty
inverse of: has publisher
comment: Inverse relation to has_publisher.
label: hat Publisher - invers @de

has related group
type: ObjectProperty
domain: change of existence
range: group
comment: Relation between an existential event for groups (beginning, end, change of existence) and a second group that is involved, such as the larger club another club is incorporated into.
label: hat assoziierte Gruppe @de

has related group - inverse
type: ObjectProperty
inverse of: has related group
comment: Inverse relation to has_related_group.
label: hat assoziierte Gruppe - invers @de

has related place
type: ObjectProperty
domain: change of existence
range: place
comment: Relation between an existential event for places (beginning, end, change of existence) and a second place that is involved, such as the city a village is incorporated into.
label: hat assoziierten Ort @de

has related place - inverse
type: ObjectProperty
inverse of: has related place
comment: Inverse relation to has_related_place.
label: hat assoziierten Ort - invers @de

has resource relation
type: ObjectProperty
domain: entity with resource relation
range: resource relation
comment: Links an entity to a relation-entity which is itself connected to a resource.
label: hat Ressourcen-Relation @de

has resource relation - inverse
type: ObjectProperty
inverse of: has resource relation
comment: Inverse relation to has_resource_relation.
label: hat Ressourcen-Relation - invers @de

has script
type: ObjectProperty
domain: entity with script
range: script
comment: Relation between an entity and the writing script of its representation, such as Latin or Cyrillic.
label: hat Schreibsystem @de

has script - inverse
type: ObjectProperty
inverse of: has script
comment: Inverse relation to has_script.
label: hat Schreibsystem - invers @de

has subject
type: ObjectProperty
domain: object
range: subject
comment: Relation between an object and its subject.
label: hat Thema oder Gegenstand @de

has_subject area
type: ObjectProperty
domain: work
range: subject area
comment: A relation between an entity of class work and its subject area.
label: hat Themenbereich @de

has_subject area - inverse
type: ObjectProperty
inverse of: has_subject area
comment: Inverse relation to has_subject_area.
label: hat Themenbereich - invers @de

has subject - inverse
type: ObjectProperty
inverse of: has subject
comment: Inverse relation to has_subject.
label: hat Thema oder Gegenstand - invers @de

has subject relation type
type: ObjectProperty
domain: subject
range: subject relation type
comment: Relation between the subject of an object and its type.
label: hat Typ der Thema-Relation @de

has subject relation type - inverse
type: ObjectProperty
inverse of: has subject relation type
comment: Inverse relation to has_subject_relation_type.
label: hat Typ der Thema-Relation - invers @de

has subject value
type: ObjectProperty
domain: subject
comment: Relation between the subject of an object an entity (of any class in the knowledge graph) representing this subject.
label: hat Thema-Wert @de

has subject value - inverse
type: ObjectProperty
inverse of: has subject value
comment: Inverse relation to has_subject_value.
label: hat Thema-Wert - invers @de

has subsequent event
type: ObjectProperty
domain: event
range: event
comment: Relation between two events where one event is subsequent to the other.
label: hat anschließendes Event @de

has subsequent event - inverse
type: ObjectProperty
inverse of: has subsequent event
comment: Inverse relation to has_subsequent_event.
label: hat anschließendes Event - invers @de

has title
type: ObjectProperty
domain: entity with title
range: title
comment: A relation between an entity and its title.
label: hat Titel @de

has title - inverse
type: ObjectProperty
inverse of: has title
comment: Inverse relation to has_title.
label: hat Titel - invers @de

has topic
type: ObjectProperty
domain: event
range: topic
comment: Relation between an event and its topic.
label: hat Thema @de

has topic - inverse
type: ObjectProperty
inverse of: has topic
comment: Inverse relation to has_topic.
label: hat Thema - invers @de

has work type
type: ObjectProperty
domain: work
range: work type
comment: A relation between an entity of class work and its type.
label: hat Typ des Werks @de

has work type - inverse
type: ObjectProperty
inverse of: has work type
comment: Inverse relation to has_work_type.
label: hat Typ des Werks - invers @de

is part of event
type: ObjectProperty
domain: event
range: event
comment: Relation between two events where one event is part of the other.
label: ist Teil des Events @de

is part of event - inverse
type: ObjectProperty
inverse of: is part of event
comment: Inverse relation to is_part_of_event.
label: ist Teil des Events - invers @de

is part of group
type: ObjectProperty
domain: group
range: part of group relation
comment: Relates a group to a relation-object, which expresses that one group is part of the other.
label: ist Teil der Gruppe @de

is part of group - inverse
type: ObjectProperty
inverse of: is part of group
comment: Inverse relation to is_part_of_group.
label: ist Teil der Gruppe - invers @de

is part of object
type: ObjectProperty
domain: object
range: object
comment: Relation between two objects where one is part of the other.
label: ist Teil des Objekts @de

is part of object - inverse
type: ObjectProperty
inverse of: is part of object
comment: Inverse relation to is_part_of_object.
label: ist Teil des Objekts - invers @de

is part of place
type: ObjectProperty
domain: place
range: part of place relation
comment: A relation between a place and a part_of_place_relation, specifies that the specific place is part of another place.
label: ist Teil des Ortes @de

is part of place - inverse
type: ObjectProperty
inverse of: is part of place
comment: Inverse relation to is_part_of_place.
label: ist Teil des Ortes - invers @de

is part of work
type: ObjectProperty
domain: work
range: work
comment: A relation between two entities of class work where one is part of the other.
label: ist Teil des Werks @de

is part of work - inverse
type: ObjectProperty
inverse of: is part of work
comment: Inverse relation to is_part_of_work.
label: ist Teil des Werks - invers @de

is published
type: ObjectProperty
domain: work
range: publication
comment: A relation between an entity of class work and its publication.
label: ist veröffentlicht @de

is published - inverse
type: ObjectProperty
inverse of: is published
comment: Inverse relation to is_published.
label: ist veröffentlicht - invers @de

has coordinates value
type: DatatypeProperty
domain: coordinates
range: string
comment: Relation between geographical coordinates of a place and the actual value.
label: hat Koordinaten-Wert @de

has degree
type: DatatypeProperty
domain: entity with degree
range: string
comment: Property containing the degree of an education-related relation.
label: hat Abschluss @de

has dimension value
type: DatatypeProperty
domain: dimension
range: Literal
comment: Relation of the dimension of an object with the numerical value of this dimension.
label: hat Dimensions-Wert @de

has field of study
type: DatatypeProperty
domain: person group relation
range: string
comment: Property containing the field of study, used mainly for education-related relations.
label: hat Fachrichtung @de

has first page
type: DatatypeProperty
domain: publication
range: integer
comment: A property containing the first page of interest of a publication.
label: hat erste Seite @de

has inscription text
type: DatatypeProperty
domain: inscription
range: Literal
comment: Relation between an inscription-object and the actual text of the inscription.
label: hat Inschriften-Text @de

has last page
type: DatatypeProperty
domain: publication
range: integer
comment: A property containing the last page of interest of a publication.
label: hat letzte Seite @de

has number of pages
type: DatatypeProperty
domain: publication
range: integer
comment: A property containing the number of pages of a publication.
label: hat Anzahl Seiten @de

has postcode
type: DatatypeProperty
domain: address
range: Literal
comment: Relation between an address and its postcode.
label: hat Postleitzahl @de

has provenance date
type: DatatypeProperty
domain: Triple
range: Literal
comment: Property of a triple containing the date it was entered into the database.
label: hat Provenienz-Datum @de

has street address
type: DatatypeProperty
domain: address
range: Literal
comment: Relation between an address-object and its actual street address as a literal.
label: hat Straßenadresse @de

is same as external reference
type: DatatypeProperty
domain: entity with external reference
range: anyURI
comment: Property containing a link to external reference (URL) about the entity, such as wikipedia-entries.
label: selbe Entität wie externe Referenz @de

actor
type: Class
subclass of: entity with object relation
comment: Superclass of person and group, entities that can act on their own behalf.
label: Akteur @de

actor object relation
type: Class
subclass of: actor relation
subclass of: entity with description
subclass of: entity with name
subclass of: timeframe related entity
subclass of: object relation
comment: An entity representing a relation where an actor (person or group) and an object play a central role, can be related to a timespan.
label: Akteur-Objekt-Relation @de

actor object relation type
type: Class
subclass of: entity with description
subclass of: entity with name
comment: The type of a relation between an object and an actor (property of, holder of, ...).
label: Akteur-Objekt-Relation-Typ @de

actor relation
type: Class
comment: Internal superclass, relations where one participant is an actor (person or group).
label: Akteur-Relation @de

address
type: Class
subclass of: entity with description
subclass of: timeframe related entity
comment: The address of a place, can be limited to a specific time period.
label: Adresse @de
property:
  min count: 1
  path:
    inverse path: has address

author
type: Class
comment: The author of an entity.
label: Autor @de

author role
type: Class
subclass of: entity with description
subclass of: entity with name
comment: The role of an author in the authoring process.
label: Autorenrolle @de

begin of existence
type: Class
subclass of: change of existence
comment: The event that is marked as the beginning of the existence of an entity, aimes primarily at geographical entities like cities or countries or at groups, can have a type
label: Beginn der Existenz @de
property:
  min count: 1
  path:
    inverse path: has begin of existence

change of existence
type: Class
subclass of: event
comment: Superclass for the events marked as the beginning end or change of the existence of an entity, subclass of event
label: Änderung der Existenz @de

change of group existence type
type: Class
subclass of: entity with description
subclass of: entity with name
comment: The type of an event that is marked as the beginning, end or as a change of the existence of an entity of type group, like founding, dissolution.
label: Typ der Änderung der Existenz einer Gruppe @de

change of place existence type
type: Class
subclass of: entity with description
subclass of: entity with name
comment: The type of an event that is marked as the beginning, end or as a change of the existence of an entity of type place.
label: Typ der Änderung der Existenz eines Ortes @de

citation
type: Class
subclass of: entity with description
comment: A citation where an entity is mentioned, is related to this entity and to a resource of class work.
label: Zitation @de

coordinates
type: Class
subclass of: entity with description
subclass of: timeframe related entity
comment: The geographical coordinates of a place, can be further described e.g. with a period of time.
label: Koordinaten @de
property:
  min count: 1
  path:
    inverse path: has coordinates
property:
  max count: 1
  min count: 1
  path: has coordinates value

dimension
type: Class
subclass of: entity with description
subclass of: entity with name
comment: An dimension of an object, containing e.g. informations about its height.
label: Dimension @de

dimension type
type: Class
subclass of: entity with description
subclass of: entity with name
comment: The type of a dimension of an object (could be height, width, diameter, ...).
label: Dimensions-Typ @de

dimension unit
type: Class
subclass of: entity with description
subclass of: entity with name
comment: The unit of a dimension of an object (could be cm, mm, ...).
label: Dimensions-Einheit @de

end of existence
type: Class
subclass of: change of existence
comment: The event that is marked as the end of the existence of an entity, aimes primarily at geographical entities like cities or countries or at groups, can have a type
label: Ende der Existenz @de
property:
  min count: 1
  path:
    inverse path: has end of existence

entity description
type: Class
subclass of: entity with author
comment: Contains the general description of an entity
label: Entitätenbeschreibung @de

entity with actor relation
type: Class
comment: Internal superclass, entities that can participate in direct relations with actors (persons or groups).
label: Entität mit Akteur-Relation @de

entity with author
type: Class
comment: All entities that can have an author.
label: Entität mit Autor @de

entity with citation
type: Class
comment: All entities that can be cited.
label: Entität mit Zitation @de

entity with degree
type: Class
comment: All entities that can have a degree or are related to one.
label: Entität mit (akad.) Titel @de

entity with description
type: Class
comment: All entities that can have an description.
label: Entität mit Beschreibung @de

entity with event relation
type: Class
comment: Internal superclass, entities that can participate in direct relations with events.
label: Entität mit Event-Relation @de

entity with existence change
type: Class
comment: Entities such as places or groups, that might be established, dissolved or experience changes to their state of existence.
label: Entität mit Existenzveränderung @de

entity with external reference
type: Class
comment: All entities that can be linked to an external reference (URI).
label: Entität mit externer Referenz @de

entity with group
type: Class
comment: All entities that can be directly linked to a group.
label: Entität mit Gruppe @de

entity with group relation
type: Class
comment: Internal superclass, all entities that can participate in direct relations with groups.
label: Entität mit Gruppenrelation @de

entity with id
type: Class
comment: All entities that can be linked to an ID such as GND.
label: Entität mit ID @de

entity with location
type: Class
comment: Internal superclass, entities that have direct relations with locations.
label: Entität mit Ort @de

entity with name
type: Class
comment: All entities that can have a name.
label: Entität mit Name @de

entity with object
type: Class
comment: Internal superclass, entities that have direct relations with objects.
label: Entität mit Objekt @de

entity with object relation
type: Class
comment: Internal superclass, entities that can participate in direct relations with objects.
label: Entität mit Objekt-Relation @de

entity with occupation value
type: Class
comment: Internal superclass, all entities that can have an occupation.
label: Entität mit Beruf @de

entity with person relation
type: Class
comment: Internal superclass, all entities that can participate in direct relations with persons.
label: Entität mit Personenrelation @de

entity with place
type: Class
comment: All entities that can be directly linked to a place.
label: Entität mit Ort @de

entity with place relation
type: Class
comment: Internal superclass, all entities that can participate in direct relations with places.
label: Entität mit Ortsrelation @de

entity with resource relation
type: Class
comment: Internal superclass, entities that can participate in direct relations with resources.
label: Entität mit Ressourcen-Relation @de

entity with script
type: Class
comment: All entities that can have a writing script.
label: Entität mit Schreibsystem @de

timeframe related entity
type: Class
comment: Entity which is directly related to a period of time.
label: Entität mit Zeitspanne @de

timepoint related entity
type: Class
comment: Entity which is directly related to a point in time.
label: Entität mit Zeitpunkt @de

entity with title
type: Class
comment: All entities that can have a title.
label: Entität mit Titel @de

event
type: Class
subclass of: entity with citation
subclass of: entity with description
subclass of: entity with event relation
subclass of: entity with external reference
subclass of: entity with id
subclass of: entity with location
subclass of: entity with name
subclass of: entity with resource relation
subclass of: timeframe related entity
comment: Any kind of event taking place, such as gatherings of people for various reasons.
label: Ereignis @de

event event relation
type: Class
subclass of: entity with description
subclass of: entity with name
subclass of: timeframe related entity
subclass of: event relation
comment: An entity representing a general relation where two events play a central role, can be related to a timespan, a name, a description and a type.
label: Event-Event-Relation @de

event event relation type
type: Class
subclass of: entity with description
subclass of: entity with name
comment: The type of a relation between two events.
label: Event-Event-Relationen-Typ @de

event relation
type: Class
comment: Internal superclass, relations where one participant is an event.
label: Event-Relation @de

event resource relation
type: Class
subclass of: entity with description
subclass of: entity with name
subclass of: timeframe related entity
subclass of: event relation
subclass of: resource relation
comment: An entity representing a relation where an event and a resource play a central role, can be related to a timespan.
label: Event-Ressourcen-Relation @de

event resource relation type
type: Class
subclass of: entity with description
subclass of: entity with name
comment: The type of a relation between an event and a resource.
label: Event-Ressourcen-Relationen-Typ @de

event type
type: Class
subclass of: entity with description
subclass of: entity with name
comment: The type of an event.
label: Eventtyp @de

gender
type: Class
subclass of: entity with description
subclass of: timeframe related entity
comment: The gender of an entity; can include a timeframe of validity if necessary.
label: Geschlecht @de

gender value
type: Class
subclass of: id
comment: The actual gender, preferably from LIDO gender actor vocabulary (see folder vocabularies on github).
label: Geschlechter-Wert @de
label: has gender value

group
type: Class
subclass of: actor
subclass of: entity with citation
subclass of: entity with description
subclass of: entity with existence change
subclass of: entity with external reference
subclass of: entity with id
subclass of: entity with location
subclass of: entity with name
subclass of: entity with person relation
comment: Different kinds of groups of people or general institutions, such as companies, clubs or schools.
label: Gruppe @de

group relation
type: Class
comment: Internal superclass, all relations where one participant is a group.
label: Gruppenrelation @de

group type
type: Class
subclass of: entity with description
subclass of: entity with name
comment: The type of a group.
label: Typ der Gruppe @de

id
type: Class
subclass of: entity with name
comment: An identifier for an entity, such as GND or wikidata IDs.
label: ID @de

id type
type: Class
subclass of: entity with description
subclass of: entity with name
comment: The type of an identifier, the instituion or website issuing it, such as GND or Wikidata.
label: ID-Typ @de

inscription
type: Class
subclass of: object
comment: An inscription, subclass of object, can be related to objects using is_part_of_object relation.
label: Inschrift @de

license
type: Class
subclass of: entity with description
subclass of: entity with name
comment: The license of a publication.
label: Lizenz @de

life state change
type: Class
subclass of: entity with description
subclass of: entity with name
subclass of: entity with place
subclass of: timepoint related entity
comment: A class consisting of birth and death events.
label: Lebensstatusänderung @de

location
type: Class
subclass of: entity with description
subclass of: entity with place
subclass of: timeframe related entity
comment: The location of an entity, can be related to a place, can be further described using a timespan.
label: Standort @de
property:
  min count: 1
  path:
    inverse path: has location
property:
  min count: 1
  path: has place

material
type: Class
subclass of: entity with description
subclass of: entity with name
comment: The material of an object.
label: Material @de

name
type: Class
subclass of: entity with degree
subclass of: entity with script
subclass of: timeframe related entity
comment: The name-object of an entity.
label: Name @de

nationality
type: Class
subclass of: timeframe related entity
comment: The nationality of an entity. Can be limited in time.
label: Nationalität @de

nationality value
type: Class
subclass of: place
comment: The actual nationality value of an entity, subclass of place, only countries should be used.
label: Nationalitätenwert @de

object
type: Class
subclass of: entity with actor relation
subclass of: entity with citation
subclass of: entity with description
subclass of: entity with external reference
subclass of: entity with id
subclass of: entity with location
subclass of: entity with name
subclass of: resource
comment: Any kind of physical object like pieces of art or monuments.
label: Objekt @de

object creation
type: Class
subclass of: entity with object
subclass of: event
comment: An event in which an object is created.
label: Objekt-Erschaffung @de

object creation type
type: Class
subclass of: entity with description
subclass of: entity with name
comment: The type of creation of an object.
label: Objekt-Erschaffungs-Typ @de

object destruction
type: Class
subclass of: entity with object
subclass of: event
comment: An event in which an object is destroyed.
label: Objekt-Zerstörung @de

object destruction type
type: Class
subclass of: entity with description
subclass of: entity with name
comment: The type of destruction in an event in which an object is destroyed.
label: Objekt-Zerstörungs-Typ @de

object modification
type: Class
subclass of: entity with object
subclass of: event
comment: An event in which an object is modified.
label: Objekt-Modifikation @de

object modification type
type: Class
subclass of: entity with description
subclass of: entity with name
comment: The type of modification of an event in which an object is modified.
label: Objekt-Modifikations-Typ @de

object relation
type: Class
comment: Internal superclass, relations where one participant is an object.
label: Objekt-Relation @de

object type
type: Class
subclass of: entity with description
subclass of: entity with name
comment: The type of an object.
label: Objekt-Typ @de

occupation
type: Class
subclass of: entity with description
subclass of: entity with name
subclass of: entity with occupation value
subclass of: timeframe related entity
comment: The occupation of an entity. Can be linked to a timeframe, a name, a description and the actual occupation value.
label: Beruf @de

occupation value
type: Class
subclass of: entity with name
subclass of: id
comment: The actual occupation-value of an occupation-relation. Use of a respective vocabulary such as HISCO is recommended.

part of group relation
type: Class
subclass of: entity with description
subclass of: entity with group
subclass of: timeframe related entity
comment: Relates two groups and expresses that one group is part of the other.
label: Teil der Gruppe-Relation @de
property:
  min count: 1
  path:
    inverse path: is part of group
property:
  min count: 1
  path: has group

part of place relation
type: Class
subclass of: entity with description
subclass of: entity with place
subclass of: timeframe related entity
comment: Central entity for describing a relation between two places where one is the part of the other. has_place-relation is used to link to the hypernym.
label: Teil des Ortes-Relation @de
property:
  min count: 1
  path:
    inverse path: is part of place
property:
  min count: 1
  path: has place

participant
type: Class
subclass of: entity with description
subclass of: timeframe related entity
comment: An participant of an event, needs to be related to an actor such as a person, can be further described with a timespan.
label: Teilnehmer:in @de

participant_role
type: Class
subclass of: entity with description
subclass of: entity with name
comment: The role a participant has in an event.
label: Teilnehmer:in-Rolle @de

person
type: Class
subclass of: actor
subclass of: entity with citation
subclass of: entity with description
subclass of: entity with external reference
subclass of: entity with group relation
subclass of: entity with id
subclass of: entity with name
subclass of: entity with person relation
subclass of: entity with place relation
comment: A human being.
label: Person @de

person group relation
type: Class
subclass of: entity with degree
subclass of: entity with description
subclass of: entity with name
subclass of: entity with occupation value
subclass of: timeframe related entity
subclass of: group relation
subclass of: person relation
comment: An entity that representing a relation where a group and a person play a central role, such as a membership.
label: Personen-Gruppen-Relation @de

person group relation type
type: Class
subclass of: entity with description
subclass of: entity with name
comment: The type of a relation between a person and a group, for example a membership, attendance at a school or university.
label: Typ der Personen-Gruppen-Relation @de

person person relation
type: Class
subclass of: entity with description
subclass of: entity with name
subclass of: timeframe related entity
subclass of: person relation
comment: An entity representing a relation where (at least) two persons play a central role.
label: Person-Person-Relation @de

person person relation role
type: Class
subclass of: entity with description
subclass of: entity with name
comment: The role of a person in a relation between persons, used for asymetric person-person-relations like teacher and student.
label: Rolle in der Person-Person-Relation @de

person person relation type
type: Class
subclass of: entity with description
subclass of: entity with name
comment: The type of a relation between persons, such as friendship.
label: Typ der Person-Person-Relation @de

person place relation
type: Class
subclass of: entity with description
subclass of: entity with name
subclass of: timeframe related entity
subclass of: person relation
subclass of: place relation
comment: An entity representing a relation where a place and a person play a central role.
label: Relation zwischen Person und Ort @de

person place relation type
type: Class
subclass of: entity with description
subclass of: entity with name
comment: The type of a relation between a place and a person.
label: Personen-Orts-Relation-Typ @de

person relation
type: Class
comment: Internal superclass, all relations where one participant is a person.
label: Personenrelation @de

physical work
type: Class
subclass of: object
subclass of: work
comment: When a work is not an abstract entity (such as Goethe's Faust) but is one with it's physical form like letters, files or records in an archive
label: physisches Werk @de

place
type: Class
subclass of: entity with citation
subclass of: entity with description
subclass of: entity with existence change
subclass of: entity with external reference
subclass of: entity with id
subclass of: entity with name
subclass of: entity with person relation
comment: A general geographic entity, can range from countries to cities or districts to buildings.
label: Ort @de

place relation
type: Class
comment: Internal superclass, all relations where one participant is a place.
label: Ortsrelation @de

place type
type: Class
subclass of: entity with description
subclass of: entity with name
comment: Specifies the type of a place, e.g. country, federal state, street.
label: Art des Ortes @de

publication
type: Class
subclass of: entity with description
subclass of: entity with name
subclass of: entity with place
subclass of: timepoint related entity
comment: The publication of an entity of class work.
label: Veröffentlichung @de

published work
type: Class
subclass of: publication
subclass of: work
comment: Works to be seen as one with their publication if there is no need for a separation
label: veröffentlichtes Werk @de

resource
type: Class
subclass of: entity with event relation
comment: Any kind of resource, superclass of object and work.
label: Ressource @de

resource relation
type: Class
comment: Internal superclass, relations where one participant is a resource.
label: Ressourcen-Relation @de

script
type: Class
subclass of: entity with description
subclass of: entity with name
comment: The writing script of an entity.
label: Schreibsystem @de

subject
type: Class
subclass of: entity with description
subclass of: entity with name
comment: The subject of an object.
label: Thema oder Gegenstand @de

subject area
type: Class
subclass of: entity with description
subclass of: entity with id
subclass of: entity with name
comment: The subject area of an entity of class work.
label: Themenbereich @de

subject relation type
type: Class
subclass of: entity with description
subclass of: entity with name
comment: The type of a subject of an object.
label: Typ der Thema-Relation @de

title
type: Class
subclass of: entity with script
subclass of: timeframe related entity
comment: The title of an entity.
label: Titel @de

topic
type: Class
subclass of: entity with description
subclass of: entity with name
comment: The topic an event is about.
label: Thema @de

work
type: Class
subclass of: entity with author
subclass of: entity with citation
subclass of: entity with description
subclass of: entity with external reference
subclass of: entity with group relation
subclass of: entity with id
subclass of: timeframe related entity
subclass of: entity with title
subclass of: resource
comment: Different types of written works, such as books, scientific papers, event programs.
label: Werk @de

work type
type: Class
subclass of: entity with description
subclass of: entity with name
comment: The type of an entity of the class work.
label: Typ des Werks @de

min count: 1
path:
  inverse path: has end of existence

min count: 1
path:
  inverse path: has begin of existence

min count: 1
path:
  inverse path: has change of existence